build-inetutils
[Top][All Lists]
Advanced

[Date Prev][Date Next][Thread Prev][Thread Next][Date Index][Thread Index]

[Build-inetutils] Hydra job gnu:inetutils-master:build build 1083669: Fa


From: Hydra Build Daemon
Subject: [Build-inetutils] Hydra job gnu:inetutils-master:build build 1083669: Failed
Date: Sat, 14 May 2011 00:39:36 +0200

Hi,

This is to let you know that Hydra build 1083669 of job 
gnu:inetutils-master:build has changed from 'Failed' to 'Failed'.

Complete build information can be found on this page: 
http://hydra.nixos.org/build/1083669

The last 50 lines of the build log are shown at the bottom of this email.

A summary of the build information follows:

Build ID:              | 1083669
Nix name:              | inetutils-UNKNOWN
Short description:     | Native Nix build on i686-freebsd
Maintainer(s):         | address@hidden, address@hidden
System:                | i686-freebsd
Derivation store path: | 
/nix/store/nw8csssz638iz5awzirv2giplkj7nhji-inetutils-UNKNOWN.drv
Output store path:     | 
/nix/store/31pcks3v44qar3l8b5xdkdp32dfnn8yv-inetutils-UNKNOWN
Time added:            | 2011-05-14 00:39:36
Build started:         | 2011-05-14 00:37:43
Build finished:        | 2011-05-14 00:39:36
Duration:              | 113s

The build inputs were:

Name        | Type   | Value
------------+--------+-------------------------------------------------------------
hydraConfig | svn    | 
https://svn.nixos.org/repos/nix/hydra-config/gnu/trunk:27172
nixpkgs     | svn    | https://svn.nixos.org/repos/nix/nixpkgs/trunk:27250
system      | string | i686-freebsd
tarball     | build  | 1083610

Regards,

The Hydra build daemon.

---
gmake[2]: Entering directory 
`/tmp/nix-build-nw8csssz638iz5awzirv2giplkj7nhji-inetutils-UNKNOWN.drv-0/inetutils-UNKNOWN/doc'
gmake[2]: Nothing to be done for `check'.
gmake[2]: Leaving directory 
`/tmp/nix-build-nw8csssz638iz5awzirv2giplkj7nhji-inetutils-UNKNOWN.drv-0/inetutils-UNKNOWN/doc'
Making check in man
gmake[2]: Entering directory 
`/tmp/nix-build-nw8csssz638iz5awzirv2giplkj7nhji-inetutils-UNKNOWN.drv-0/inetutils-UNKNOWN/man'
gmake[2]: Nothing to be done for `check'.
gmake[2]: Leaving directory 
`/tmp/nix-build-nw8csssz638iz5awzirv2giplkj7nhji-inetutils-UNKNOWN.drv-0/inetutils-UNKNOWN/man'
Making check in tests
gmake[2]: Entering directory 
`/tmp/nix-build-nw8csssz638iz5awzirv2giplkj7nhji-inetutils-UNKNOWN.drv-0/inetutils-UNKNOWN/tests'
gmake  localhost addrpeek \
          ping-localhost.sh traceroute-localhost.sh tftp.sh
gmake[3]: Entering directory 
`/tmp/nix-build-nw8csssz638iz5awzirv2giplkj7nhji-inetutils-UNKNOWN.drv-0/inetutils-UNKNOWN/tests'
\
#       source='localhost.c' object='localhost.o' libtool=no
gcc -std=gnu99 -DHAVE_CONFIG_H -I. -I..  -I../libinetutils -I../lib 
-D_THREAD_SAFE  -g -O2 -c localhost.c
gcc -std=gnu99  -g -O2   -o localhost localhost.o -L../libinetutils -linetutils 
 ../lib/libgnu.a
\
#       source='addrpeek.c' object='addrpeek.o' libtool=no
gcc -std=gnu99 -DHAVE_CONFIG_H -I. -I..  -I../libinetutils -I../lib 
-D_THREAD_SAFE  -g -O2 -c addrpeek.c
gcc -std=gnu99  -g -O2   -o addrpeek addrpeek.o -L../libinetutils -linetutils  
../lib/libgnu.a
gmake[3]: Nothing to be done for `ping-localhost.sh'.
gmake[3]: Nothing to be done for `traceroute-localhost.sh'.
gmake[3]: Nothing to be done for `tftp.sh'.
gmake[3]: Leaving directory 
`/tmp/nix-build-nw8csssz638iz5awzirv2giplkj7nhji-inetutils-UNKNOWN.drv-0/inetutils-UNKNOWN/tests'
gmake  check-TESTS
gmake[3]: Entering directory 
`/tmp/nix-build-nw8csssz638iz5awzirv2giplkj7nhji-inetutils-UNKNOWN.drv-0/inetutils-UNKNOWN/tests'
localhost: phillip.buildfarm-net
PASS: localhost
PASS: addrpeek
ping needs to run as root
SKIP: ping-localhost.sh
traceroute needs to run as root
SKIP: traceroute-localhost.sh
Failed in starting correct Inetd instance.
FAIL: tftp.sh
======================================
1 of 3 tests failed
(2 tests were not run)
Please report to address@hidden
======================================
gmake[3]: *** [check-TESTS] Error 1
gmake[3]: Leaving directory 
`/tmp/nix-build-nw8csssz638iz5awzirv2giplkj7nhji-inetutils-UNKNOWN.drv-0/inetutils-UNKNOWN/tests'
gmake[2]: *** [check-am] Error 2
gmake[2]: Leaving directory 
`/tmp/nix-build-nw8csssz638iz5awzirv2giplkj7nhji-inetutils-UNKNOWN.drv-0/inetutils-UNKNOWN/tests'
gmake[1]: *** [check-recursive] Error 1
gmake[1]: Leaving directory 
`/tmp/nix-build-nw8csssz638iz5awzirv2giplkj7nhji-inetutils-UNKNOWN.drv-0/inetutils-UNKNOWN'
gmake: *** [check] Error 2
build time elapsed:  0m0.008s 0m0.016s 0m46.675s 0m15.948s
Copying build directory to 
/nix/store/31pcks3v44qar3l8b5xdkdp32dfnn8yv-inetutils-UNKNOWN/nix-build-nw8csssz638iz5awzirv2giplkj7nhji-inetutils-UNKNOWN.drv-0
build failed with exit code 2 (ignored)



reply via email to

[Prev in Thread] Current Thread [Next in Thread]