guile-commits
[Top][All Lists]
Advanced

[Date Prev][Date Next][Thread Prev][Thread Next][Date Index][Thread Index]

[Guile-commits] Hydra job gnu:guile-master:build_without_threads build 3


From: Hydra Build Daemon
Subject: [Guile-commits] Hydra job gnu:guile-master:build_without_threads build 310604 FAILED
Date: Thu, 4 Mar 2010 17:11:52 +0100

Hi,

This is to let you know that Hydra build 310604 of job 
gnu:guile-master:build_without_threads has changed from SUCCEEDED to FAILED.

Complete build information can be found on this page: 
http://hydra.nixos.org/build/310604

The last 50 lines of the build log are shown at the bottom of this email.

A summary of the build information follows:

Build ID:              | 310604
Nix name:              | guile-without-threads-1.9.8.70
Short description:     | Native Nix build on i686-darwin
Maintainer(s):         | address@hidden
System:                | i686-darwin
Derivation store path: | 
/nix/store/0wq3a2plbpk31p3fhii2jzlida0p4hnp-guile-without-threads-1.9.8.70.drv
Output store path:     | 
/nix/store/wg2vr18mqm9a1r66948blh6maazkz3l7-guile-without-threads-1.9.8.70
Time added:            | 2010-03-04 17:11:52
Build started:         | 2010-03-04 17:08:22
Build finished:        | 2010-03-04 17:11:52
Duration:              | 210s

The build inputs were:

Name        | Type   | Value
------------+--------+-------------------------------------------------------------
hydraConfig | svn    | 
https://svn.nixos.org/repos/nix/hydra-config/gnu/trunk:20296
nixpkgs     | svn    | https://svn.nixos.org/repos/nix/nixpkgs/trunk:20385
system      | string | i686-darwin
tarball     | build  | 310494

Regards,

The Hydra build daemon.

---
libtool: compile:  gcc -std=gnu99 -DHAVE_CONFIG_H -DBUILDING_LIBGUILE=1 -I.. 
-I.. -I../lib -I../lib 
-I/nix/store/x3yci702zj77mz8572alyq2kas5nlya2-libffi-3.0.9/lib/libffi-3.0.9/include
 -I/nix/store/rrpmpilssljyjjfdl0ywgm0vj9ln6sww-libiconv-1.13.1/include 
-I/nix/store/qxmr34qn3l4aw4zj6n2k0j0vn7a5zbi4-libunistring-0.9.2.1/include 
-I/nix/store/qgss6g28qqpqj2fkk5m0fw9ki8snqs7z-gmp-4.3.1/include 
-I/nix/store/i3cj9bpb21pnr73h9mmmnlkgf5qsl137-readline-6.1/include 
-I/nix/store/rrpmpilssljyjjfdl0ywgm0vj9ln6sww-libiconv-1.13.1/include 
-I/nix/store/qxmr34qn3l4aw4zj6n2k0j0vn7a5zbi4-libunistring-0.9.2.1/include 
-I/nix/store/qgss6g28qqpqj2fkk5m0fw9ki8snqs7z-gmp-4.3.1/include 
-I/nix/store/i3cj9bpb21pnr73h9mmmnlkgf5qsl137-readline-6.1/include -Wall 
-Wmissing-prototypes -Wdeclaration-after-statement -Wundef -Wswitch-enum 
-fvisibility=hidden 
-I/nix/store/4bclx3vpkjn0azgw4g1iv06787ppk503-boehm-gc-7.1/include -g -O2 -c 
trees.c  -fno-common -DPIC -o .libs/libguile_la-trees.o
In file included from trees.c:26:
../libguile/_scm.h:122:5: warning: "GUILE_USE_64_CALLS" is not defined
building libguile_la-uniform.lo
/bin/sh ../libtool --tag=CC   --mode=compile gcc -std=gnu99 
-DHAVE_CONFIG_H   -DBUILDING_LIBGUILE=1 -I.. -I.. -I../lib -I../lib 
-I/nix/store/x3yci702zj77mz8572alyq2kas5nlya2-libffi-3.0.9/lib/libffi-3.0.9/include
   -I/nix/store/rrpmpilssljyjjfdl0ywgm0vj9ln6sww-libiconv-1.13.1/include 
-I/nix/store/qxmr34qn3l4aw4zj6n2k0j0vn7a5zbi4-libunistring-0.9.2.1/include 
-I/nix/store/qgss6g28qqpqj2fkk5m0fw9ki8snqs7z-gmp-4.3.1/include 
-I/nix/store/i3cj9bpb21pnr73h9mmmnlkgf5qsl137-readline-6.1/include 
-I/nix/store/rrpmpilssljyjjfdl0ywgm0vj9ln6sww-libiconv-1.13.1/include 
-I/nix/store/qxmr34qn3l4aw4zj6n2k0j0vn7a5zbi4-libunistring-0.9.2.1/include 
-I/nix/store/qgss6g28qqpqj2fkk5m0fw9ki8snqs7z-gmp-4.3.1/include 
-I/nix/store/i3cj9bpb21pnr73h9mmmnlkgf5qsl137-readline-6.1/include  -Wall 
-Wmissing-prototypes -Wdeclaration-after-statement -Wundef -Wswitch-enum 
-fvisibility=hidden 
-I/nix/store/4bclx3vpkjn0azgw4g1iv06787ppk503-boehm-gc-7.1/include   -g -O2 -c 
-o libguile_la-uniform.lo `test -f 'u!
 niform.c' || echo './'`uniform.c
libtool: compile:  gcc -std=gnu99 -DHAVE_CONFIG_H -DBUILDING_LIBGUILE=1 -I.. 
-I.. -I../lib -I../lib 
-I/nix/store/x3yci702zj77mz8572alyq2kas5nlya2-libffi-3.0.9/lib/libffi-3.0.9/include
 -I/nix/store/rrpmpilssljyjjfdl0ywgm0vj9ln6sww-libiconv-1.13.1/include 
-I/nix/store/qxmr34qn3l4aw4zj6n2k0j0vn7a5zbi4-libunistring-0.9.2.1/include 
-I/nix/store/qgss6g28qqpqj2fkk5m0fw9ki8snqs7z-gmp-4.3.1/include 
-I/nix/store/i3cj9bpb21pnr73h9mmmnlkgf5qsl137-readline-6.1/include 
-I/nix/store/rrpmpilssljyjjfdl0ywgm0vj9ln6sww-libiconv-1.13.1/include 
-I/nix/store/qxmr34qn3l4aw4zj6n2k0j0vn7a5zbi4-libunistring-0.9.2.1/include 
-I/nix/store/qgss6g28qqpqj2fkk5m0fw9ki8snqs7z-gmp-4.3.1/include 
-I/nix/store/i3cj9bpb21pnr73h9mmmnlkgf5qsl137-readline-6.1/include -Wall 
-Wmissing-prototypes -Wdeclaration-after-statement -Wundef -Wswitch-enum 
-fvisibility=hidden 
-I/nix/store/4bclx3vpkjn0azgw4g1iv06787ppk503-boehm-gc-7.1/include -g -O2 -c 
uniform.c  -fno-common -DPIC -o .libs/libguile_la-uniform.o
In file included from uniform.c:26:
../libguile/_scm.h:122:5: warning: "GUILE_USE_64_CALLS" is not defined
building libguile_la-values.lo
/bin/sh ../libtool --tag=CC   --mode=compile gcc -std=gnu99 
-DHAVE_CONFIG_H   -DBUILDING_LIBGUILE=1 -I.. -I.. -I../lib -I../lib 
-I/nix/store/x3yci702zj77mz8572alyq2kas5nlya2-libffi-3.0.9/lib/libffi-3.0.9/include
   -I/nix/store/rrpmpilssljyjjfdl0ywgm0vj9ln6sww-libiconv-1.13.1/include 
-I/nix/store/qxmr34qn3l4aw4zj6n2k0j0vn7a5zbi4-libunistring-0.9.2.1/include 
-I/nix/store/qgss6g28qqpqj2fkk5m0fw9ki8snqs7z-gmp-4.3.1/include 
-I/nix/store/i3cj9bpb21pnr73h9mmmnlkgf5qsl137-readline-6.1/include 
-I/nix/store/rrpmpilssljyjjfdl0ywgm0vj9ln6sww-libiconv-1.13.1/include 
-I/nix/store/qxmr34qn3l4aw4zj6n2k0j0vn7a5zbi4-libunistring-0.9.2.1/include 
-I/nix/store/qgss6g28qqpqj2fkk5m0fw9ki8snqs7z-gmp-4.3.1/include 
-I/nix/store/i3cj9bpb21pnr73h9mmmnlkgf5qsl137-readline-6.1/include  -Wall 
-Wmissing-prototypes -Wdeclaration-after-statement -Wundef -Wswitch-enum 
-fvisibility=hidden 
-I/nix/store/4bclx3vpkjn0azgw4g1iv06787ppk503-boehm-gc-7.1/include   -g -O2 -c 
-o libguile_la-values.lo `test -f 'va!
 lues.c' || echo './'`values.c
libtool: compile:  gcc -std=gnu99 -DHAVE_CONFIG_H -DBUILDING_LIBGUILE=1 -I.. 
-I.. -I../lib -I../lib 
-I/nix/store/x3yci702zj77mz8572alyq2kas5nlya2-libffi-3.0.9/lib/libffi-3.0.9/include
 -I/nix/store/rrpmpilssljyjjfdl0ywgm0vj9ln6sww-libiconv-1.13.1/include 
-I/nix/store/qxmr34qn3l4aw4zj6n2k0j0vn7a5zbi4-libunistring-0.9.2.1/include 
-I/nix/store/qgss6g28qqpqj2fkk5m0fw9ki8snqs7z-gmp-4.3.1/include 
-I/nix/store/i3cj9bpb21pnr73h9mmmnlkgf5qsl137-readline-6.1/include 
-I/nix/store/rrpmpilssljyjjfdl0ywgm0vj9ln6sww-libiconv-1.13.1/include 
-I/nix/store/qxmr34qn3l4aw4zj6n2k0j0vn7a5zbi4-libunistring-0.9.2.1/include 
-I/nix/store/qgss6g28qqpqj2fkk5m0fw9ki8snqs7z-gmp-4.3.1/include 
-I/nix/store/i3cj9bpb21pnr73h9mmmnlkgf5qsl137-readline-6.1/include -Wall 
-Wmissing-prototypes -Wdeclaration-after-statement -Wundef -Wswitch-enum 
-fvisibility=hidden 
-I/nix/store/4bclx3vpkjn0azgw4g1iv06787ppk503-boehm-gc-7.1/include -g -O2 -c 
values.c  -fno-common -DPIC -o .libs/libguile_la-values.o
In file included from values.c:23:
../libguile/_scm.h:122:5: warning: "GUILE_USE_64_CALLS" is not defined
building libguile_la-variable.lo
/bin/sh ../libtool --tag=CC   --mode=compile gcc -std=gnu99 
-DHAVE_CONFIG_H   -DBUILDING_LIBGUILE=1 -I.. -I.. -I../lib -I../lib 
-I/nix/store/x3yci702zj77mz8572alyq2kas5nlya2-libffi-3.0.9/lib/libffi-3.0.9/include
   -I/nix/store/rrpmpilssljyjjfdl0ywgm0vj9ln6sww-libiconv-1.13.1/include 
-I/nix/store/qxmr34qn3l4aw4zj6n2k0j0vn7a5zbi4-libunistring-0.9.2.1/include 
-I/nix/store/qgss6g28qqpqj2fkk5m0fw9ki8snqs7z-gmp-4.3.1/include 
-I/nix/store/i3cj9bpb21pnr73h9mmmnlkgf5qsl137-readline-6.1/include 
-I/nix/store/rrpmpilssljyjjfdl0ywgm0vj9ln6sww-libiconv-1.13.1/include 
-I/nix/store/qxmr34qn3l4aw4zj6n2k0j0vn7a5zbi4-libunistring-0.9.2.1/include 
-I/nix/store/qgss6g28qqpqj2fkk5m0fw9ki8snqs7z-gmp-4.3.1/include 
-I/nix/store/i3cj9bpb21pnr73h9mmmnlkgf5qsl137-readline-6.1/include  -Wall 
-Wmissing-prototypes -Wdeclaration-after-statement -Wundef -Wswitch-enum 
-fvisibility=hidden 
-I/nix/store/4bclx3vpkjn0azgw4g1iv06787ppk503-boehm-gc-7.1/include   -g -O2 -c 
-o libguile_la-variable.lo `test -f '!
 variable.c' || echo './'`variable.c
libtool: compile:  gcc -std=gnu99 -DHAVE_CONFIG_H -DBUILDING_LIBGUILE=1 -I.. 
-I.. -I../lib -I../lib 
-I/nix/store/x3yci702zj77mz8572alyq2kas5nlya2-libffi-3.0.9/lib/libffi-3.0.9/include
 -I/nix/store/rrpmpilssljyjjfdl0ywgm0vj9ln6sww-libiconv-1.13.1/include 
-I/nix/store/qxmr34qn3l4aw4zj6n2k0j0vn7a5zbi4-libunistring-0.9.2.1/include 
-I/nix/store/qgss6g28qqpqj2fkk5m0fw9ki8snqs7z-gmp-4.3.1/include 
-I/nix/store/i3cj9bpb21pnr73h9mmmnlkgf5qsl137-readline-6.1/include 
-I/nix/store/rrpmpilssljyjjfdl0ywgm0vj9ln6sww-libiconv-1.13.1/include 
-I/nix/store/qxmr34qn3l4aw4zj6n2k0j0vn7a5zbi4-libunistring-0.9.2.1/include 
-I/nix/store/qgss6g28qqpqj2fkk5m0fw9ki8snqs7z-gmp-4.3.1/include 
-I/nix/store/i3cj9bpb21pnr73h9mmmnlkgf5qsl137-readline-6.1/include -Wall 
-Wmissing-prototypes -Wdeclaration-after-statement -Wundef -Wswitch-enum 
-fvisibility=hidden 
-I/nix/store/4bclx3vpkjn0azgw4g1iv06787ppk503-boehm-gc-7.1/include -g -O2 -c 
variable.c  -fno-common -DPIC -o .libs/libguile_la-variable.o
In file included from variable.c:25:
../libguile/_scm.h:122:5: warning: "GUILE_USE_64_CALLS" is not defined
building libguile_la-vectors.lo
/bin/sh ../libtool --tag=CC   --mode=compile gcc -std=gnu99 
-DHAVE_CONFIG_H   -DBUILDING_LIBGUILE=1 -I.. -I.. -I../lib -I../lib 
-I/nix/store/x3yci702zj77mz8572alyq2kas5nlya2-libffi-3.0.9/lib/libffi-3.0.9/include
   -I/nix/store/rrpmpilssljyjjfdl0ywgm0vj9ln6sww-libiconv-1.13.1/include 
-I/nix/store/qxmr34qn3l4aw4zj6n2k0j0vn7a5zbi4-libunistring-0.9.2.1/include 
-I/nix/store/qgss6g28qqpqj2fkk5m0fw9ki8snqs7z-gmp-4.3.1/include 
-I/nix/store/i3cj9bpb21pnr73h9mmmnlkgf5qsl137-readline-6.1/include 
-I/nix/store/rrpmpilssljyjjfdl0ywgm0vj9ln6sww-libiconv-1.13.1/include 
-I/nix/store/qxmr34qn3l4aw4zj6n2k0j0vn7a5zbi4-libunistring-0.9.2.1/include 
-I/nix/store/qgss6g28qqpqj2fkk5m0fw9ki8snqs7z-gmp-4.3.1/include 
-I/nix/store/i3cj9bpb21pnr73h9mmmnlkgf5qsl137-readline-6.1/include  -Wall 
-Wmissing-prototypes -Wdeclaration-after-statement -Wundef -Wswitch-enum 
-fvisibility=hidden 
-I/nix/store/4bclx3vpkjn0azgw4g1iv06787ppk503-boehm-gc-7.1/include   -g -O2 -c 
-o libguile_la-vectors.lo `test -f 'v!
 ectors.c' || echo './'`vectors.c
libtool: compile:  gcc -std=gnu99 -DHAVE_CONFIG_H -DBUILDING_LIBGUILE=1 -I.. 
-I.. -I../lib -I../lib 
-I/nix/store/x3yci702zj77mz8572alyq2kas5nlya2-libffi-3.0.9/lib/libffi-3.0.9/include
 -I/nix/store/rrpmpilssljyjjfdl0ywgm0vj9ln6sww-libiconv-1.13.1/include 
-I/nix/store/qxmr34qn3l4aw4zj6n2k0j0vn7a5zbi4-libunistring-0.9.2.1/include 
-I/nix/store/qgss6g28qqpqj2fkk5m0fw9ki8snqs7z-gmp-4.3.1/include 
-I/nix/store/i3cj9bpb21pnr73h9mmmnlkgf5qsl137-readline-6.1/include 
-I/nix/store/rrpmpilssljyjjfdl0ywgm0vj9ln6sww-libiconv-1.13.1/include 
-I/nix/store/qxmr34qn3l4aw4zj6n2k0j0vn7a5zbi4-libunistring-0.9.2.1/include 
-I/nix/store/qgss6g28qqpqj2fkk5m0fw9ki8snqs7z-gmp-4.3.1/include 
-I/nix/store/i3cj9bpb21pnr73h9mmmnlkgf5qsl137-readline-6.1/include -Wall 
-Wmissing-prototypes -Wdeclaration-after-statement -Wundef -Wswitch-enum 
-fvisibility=hidden 
-I/nix/store/4bclx3vpkjn0azgw4g1iv06787ppk503-boehm-gc-7.1/include -g -O2 -c 
vectors.c  -fno-common -DPIC -o .libs/libguile_la-vectors.o
In file included from vectors.c:25:
../libguile/_scm.h:122:5: warning: "GUILE_USE_64_CALLS" is not defined
building libguile_la-version.lo
/bin/sh ../libtool --tag=CC   --mode=compile gcc -std=gnu99 
-DHAVE_CONFIG_H   -DBUILDING_LIBGUILE=1 -I.. -I.. -I../lib -I../lib 
-I/nix/store/x3yci702zj77mz8572alyq2kas5nlya2-libffi-3.0.9/lib/libffi-3.0.9/include
   -I/nix/store/rrpmpilssljyjjfdl0ywgm0vj9ln6sww-libiconv-1.13.1/include 
-I/nix/store/qxmr34qn3l4aw4zj6n2k0j0vn7a5zbi4-libunistring-0.9.2.1/include 
-I/nix/store/qgss6g28qqpqj2fkk5m0fw9ki8snqs7z-gmp-4.3.1/include 
-I/nix/store/i3cj9bpb21pnr73h9mmmnlkgf5qsl137-readline-6.1/include 
-I/nix/store/rrpmpilssljyjjfdl0ywgm0vj9ln6sww-libiconv-1.13.1/include 
-I/nix/store/qxmr34qn3l4aw4zj6n2k0j0vn7a5zbi4-libunistring-0.9.2.1/include 
-I/nix/store/qgss6g28qqpqj2fkk5m0fw9ki8snqs7z-gmp-4.3.1/include 
-I/nix/store/i3cj9bpb21pnr73h9mmmnlkgf5qsl137-readline-6.1/include  -Wall 
-Wmissing-prototypes -Wdeclaration-after-statement -Wundef -Wswitch-enum 
-fvisibility=hidden 
-I/nix/store/4bclx3vpkjn0azgw4g1iv06787ppk503-boehm-gc-7.1/include   -g -O2 -c 
-o libguile_la-version.lo `test -f 'v!
 ersion.c' || echo './'`version.c
libtool: compile:  gcc -std=gnu99 -DHAVE_CONFIG_H -DBUILDING_LIBGUILE=1 -I.. 
-I.. -I../lib -I../lib 
-I/nix/store/x3yci702zj77mz8572alyq2kas5nlya2-libffi-3.0.9/lib/libffi-3.0.9/include
 -I/nix/store/rrpmpilssljyjjfdl0ywgm0vj9ln6sww-libiconv-1.13.1/include 
-I/nix/store/qxmr34qn3l4aw4zj6n2k0j0vn7a5zbi4-libunistring-0.9.2.1/include 
-I/nix/store/qgss6g28qqpqj2fkk5m0fw9ki8snqs7z-gmp-4.3.1/include 
-I/nix/store/i3cj9bpb21pnr73h9mmmnlkgf5qsl137-readline-6.1/include 
-I/nix/store/rrpmpilssljyjjfdl0ywgm0vj9ln6sww-libiconv-1.13.1/include 
-I/nix/store/qxmr34qn3l4aw4zj6n2k0j0vn7a5zbi4-libunistring-0.9.2.1/include 
-I/nix/store/qgss6g28qqpqj2fkk5m0fw9ki8snqs7z-gmp-4.3.1/include 
-I/nix/store/i3cj9bpb21pnr73h9mmmnlkgf5qsl137-readline-6.1/include -Wall 
-Wmissing-prototypes -Wdeclaration-after-statement -Wundef -Wswitch-enum 
-fvisibility=hidden 
-I/nix/store/4bclx3vpkjn0azgw4g1iv06787ppk503-boehm-gc-7.1/include -g -O2 -c 
version.c  -fno-common -DPIC -o .libs/libguile_la-version.o
In file included from version.c:26:
../libguile/_scm.h:122:5: warning: "GUILE_USE_64_CALLS" is not defined
building libguile_la-vm.lo
/bin/sh ../libtool --tag=CC   --mode=compile gcc -std=gnu99 
-DHAVE_CONFIG_H   -DBUILDING_LIBGUILE=1 -I.. -I.. -I../lib -I../lib 
-I/nix/store/x3yci702zj77mz8572alyq2kas5nlya2-libffi-3.0.9/lib/libffi-3.0.9/include
   -I/nix/store/rrpmpilssljyjjfdl0ywgm0vj9ln6sww-libiconv-1.13.1/include 
-I/nix/store/qxmr34qn3l4aw4zj6n2k0j0vn7a5zbi4-libunistring-0.9.2.1/include 
-I/nix/store/qgss6g28qqpqj2fkk5m0fw9ki8snqs7z-gmp-4.3.1/include 
-I/nix/store/i3cj9bpb21pnr73h9mmmnlkgf5qsl137-readline-6.1/include 
-I/nix/store/rrpmpilssljyjjfdl0ywgm0vj9ln6sww-libiconv-1.13.1/include 
-I/nix/store/qxmr34qn3l4aw4zj6n2k0j0vn7a5zbi4-libunistring-0.9.2.1/include 
-I/nix/store/qgss6g28qqpqj2fkk5m0fw9ki8snqs7z-gmp-4.3.1/include 
-I/nix/store/i3cj9bpb21pnr73h9mmmnlkgf5qsl137-readline-6.1/include  -Wall 
-Wmissing-prototypes -Wdeclaration-after-statement -Wundef -Wswitch-enum 
-fvisibility=hidden 
-I/nix/store/4bclx3vpkjn0azgw4g1iv06787ppk503-boehm-gc-7.1/include   -g -O2 -c 
-o libguile_la-vm.lo `test -f 'vm.c' !
 || echo './'`vm.c
libtool: compile:  gcc -std=gnu99 -DHAVE_CONFIG_H -DBUILDING_LIBGUILE=1 -I.. 
-I.. -I../lib -I../lib 
-I/nix/store/x3yci702zj77mz8572alyq2kas5nlya2-libffi-3.0.9/lib/libffi-3.0.9/include
 -I/nix/store/rrpmpilssljyjjfdl0ywgm0vj9ln6sww-libiconv-1.13.1/include 
-I/nix/store/qxmr34qn3l4aw4zj6n2k0j0vn7a5zbi4-libunistring-0.9.2.1/include 
-I/nix/store/qgss6g28qqpqj2fkk5m0fw9ki8snqs7z-gmp-4.3.1/include 
-I/nix/store/i3cj9bpb21pnr73h9mmmnlkgf5qsl137-readline-6.1/include 
-I/nix/store/rrpmpilssljyjjfdl0ywgm0vj9ln6sww-libiconv-1.13.1/include 
-I/nix/store/qxmr34qn3l4aw4zj6n2k0j0vn7a5zbi4-libunistring-0.9.2.1/include 
-I/nix/store/qgss6g28qqpqj2fkk5m0fw9ki8snqs7z-gmp-4.3.1/include 
-I/nix/store/i3cj9bpb21pnr73h9mmmnlkgf5qsl137-readline-6.1/include -Wall 
-Wmissing-prototypes -Wdeclaration-after-statement -Wundef -Wswitch-enum 
-fvisibility=hidden 
-I/nix/store/4bclx3vpkjn0azgw4g1iv06787ppk503-boehm-gc-7.1/include -g -O2 -c 
vm.c  -fno-common -DPIC -o .libs/libguile_la-vm.o
In file included from vm.c:30:
_scm.h:122:5: warning: "GUILE_USE_64_CALLS" is not defined
vm-engine.c: In function 'vm_debug_engine':
vm-engine.c:38: internal compiler error: in unify_nodes, at 
tree-ssa-structalias.c:1231
Please submit a full bug report,
with preprocessed source if appropriate.
See <URL:http://developer.apple.com/bugreporter> for instructions.
make[3]: *** [libguile_la-vm.lo] Error 1
make[3]: Leaving directory 
`/private/tmp/nix-build-0wq3a2plbpk31p3fhii2jzlida0p4hnp-guile-without-threads-1.9.8.70.drv-0/guile-1.9.8.70.g2150e9a/libguile'
make[2]: *** [all] Error 2
make[2]: Leaving directory 
`/private/tmp/nix-build-0wq3a2plbpk31p3fhii2jzlida0p4hnp-guile-without-threads-1.9.8.70.drv-0/guile-1.9.8.70.g2150e9a/libguile'
make[1]: *** [all-recursive] Error 1
make[1]: Leaving directory 
`/private/tmp/nix-build-0wq3a2plbpk31p3fhii2jzlida0p4hnp-guile-without-threads-1.9.8.70.drv-0/guile-1.9.8.70.g2150e9a'
make: *** [all] Error 2
build time elapsed:  0m0.044s 0m0.022s 2m3.198s 0m56.567s
builder for 
`/nix/store/0wq3a2plbpk31p3fhii2jzlida0p4hnp-guile-without-threads-1.9.8.70.drv'
 failed with exit code 2
error: build of 
`/nix/store/0wq3a2plbpk31p3fhii2jzlida0p4hnp-guile-without-threads-1.9.8.70.drv'
 failed
Shared connection to black closed.

build of 
`/nix/store/0wq3a2plbpk31p3fhii2jzlida0p4hnp-guile-without-threads-1.9.8.70.drv'
 on address@hidden' failed with exit code 256




reply via email to

[Prev in Thread] Current Thread [Next in Thread]