guile-commits
[Top][All Lists]
Advanced

[Date Prev][Date Next][Thread Prev][Thread Next][Date Index][Thread Index]

[Guile-commits] Hydra job gnu:guile-2-0:build build 1792728: Failed


From: Hydra Build Daemon
Subject: [Guile-commits] Hydra job gnu:guile-2-0:build build 1792728: Failed
Date: Tue, 10 Jan 2012 23:34:58 +0100

Hi,

This is to let you know that Hydra build 1792728 of job gnu:guile-2-0:build has 
changed from 'Success' to 'Failed'.

Complete build information can be found on this page: 
http://hydra.nixos.org/build/1792728

The last 50 lines of the build log are shown at the bottom of this email.

A summary of the build information follows:

Build ID:              | 1792728
Nix name:              | guile-2.0.3.141-bbe34
Short description:     | Native Nix build on x86_64-linux
Maintainer(s):         | address@hidden
System:                | x86_64-linux
Derivation store path: | 
/nix/store/0arxjcdk1457lz2cgnbdsr175kks2fvy-guile-2.0.3.141-bbe34.drv
Output store path:     | 
/nix/store/xsgxz1pzd76kzn530nyva95950z3982m-guile-2.0.3.141-bbe34
Time added:            | 2012-01-10 23:34:58
Build started:         | 2012-01-10 23:03:10
Build finished:        | 2012-01-10 23:34:58
Duration:              | 1908s

The build inputs were:

Name        | Type   | Value
------------+--------+--------------------------------------------------------------------------------------
hydraConfig | git    | 
git://git.savannah.gnu.org/hydra-recipes.git:e2534a88409584944dd0e261f748b514d821b45e
nixpkgs     | svn    | https://nixos.org/repos/nix/nixpkgs/trunk:31473
system      | string | x86_64-linux
tarball     | build  | 1792542

Regards,

The Hydra build daemon.

---
Running sxml.transform.test
Running sxml.xpath.test
Running symbols.test
Running syncase.test
Running syntax.test
UNRESOLVED: syntax.test: letrec: bindings: initial bindings are undefined
UNRESOLVED: syntax.test: letrec*: bindings: initial bindings are undefined
Running texinfo.docbook.test
Running texinfo.serialize.test
Running texinfo.string-utils.test
Running texinfo.test
Running threads.test
Running time.test
Running tree-il.test
UNRESOLVED: tree-il.test: warnings: unused-toplevel: used by macro
Running version.test
UNRESOLVED: version.test: version reporting works
Running vlist.test
Running weaks.test
Running web-http.test
Running web-request.test
Running web-response.test
Running web-uri.test

Totals for this test run:
passes:                 34344
failures:               1
unexpected passes:      0
expected failures:      30
unresolved test cases:  561
untested test cases:    1
unsupported test cases: 9
errors:                 0

WARNING: (test-suite sxml-xpath): imported module (sxml xpath) overrides core 
binding `filter'
FAIL: check-guile
==================================
1 of 1 test failed
Please report to address@hidden
==================================
make[3]: *** [check-TESTS] Error 1
make[3]: Leaving directory 
`/tmp/nix-build-0arxjcdk1457lz2cgnbdsr175kks2fvy-guile-2.0.3.141-bbe34.drv-0/build'
make[2]: *** [check-am] Error 2
make[2]: Leaving directory 
`/tmp/nix-build-0arxjcdk1457lz2cgnbdsr175kks2fvy-guile-2.0.3.141-bbe34.drv-0/build'
make[1]: *** [check-recursive] Error 1
make[1]: Leaving directory 
`/tmp/nix-build-0arxjcdk1457lz2cgnbdsr175kks2fvy-guile-2.0.3.141-bbe34.drv-0/build'
make: *** [check] Error 2
build time elapsed:  0m0.029s 0m0.018s 30m15.337s 1m13.917s
Copying build directory to 
/nix/store/xsgxz1pzd76kzn530nyva95950z3982m-guile-2.0.3.141-bbe34/nix-build-0arxjcdk1457lz2cgnbdsr175kks2fvy-guile-2.0.3.141-bbe34.drv-0
build failed with exit code 2 (ignored)



reply via email to

[Prev in Thread] Current Thread [Next in Thread]