[Top][All Lists]

[Date Prev][Date Next][Thread Prev][Thread Next][Date Index][Thread Index]

Re: [Qemu-devel] [PATCH v6 00/28] Migration: postcopy failure recovery

From: no-reply
Subject: Re: [Qemu-devel] [PATCH v6 00/28] Migration: postcopy failure recovery
Date: Thu, 8 Feb 2018 03:30:14 -0800 (PST)


This series failed address@hidden build test. Please find the testing commands 
their output below. If you have Docker installed, you can probably reproduce it

Type: series
Message-id: address@hidden
Subject: [Qemu-devel] [PATCH v6 00/28] Migration: postcopy failure recovery

set -e
git submodule update --init dtc
# Let docker tests dump environment info
export SHOW_ENV=1
export J=8
time make address@hidden

Updating 3c8cf5a9c21ff8782164d1def7f44bd888713384
Switched to a new branch 'test'
9fef7a46b1 migration/hmp: add migrate_pause command
e5bc8840cf migration/qmp: add command migrate-pause
ae62f074ca hmp/migration: add migrate_recover command
b6a9d72a90 qmp/migration: new command migrate-recover
9903aa7296 io: let watcher of the channel run in same ctx
ef37cc9981 migration: init dst in migration_object_init too
b9a7a6376d migration: final handshake for the resume
40d1c0e37c migration: setup ramstate for resume
4faada932e migration: synchronize dirty bitmap for resume
1c86b22e54 migration: introduce SaveVMHandlers.resume_prepare
99d5d3ec65 migration: new message MIG_RP_MSG_RESUME_ACK
011a3e5dcf migration: new cmd MIG_CMD_POSTCOPY_RESUME
e8ea13af80 migration: new message MIG_RP_MSG_RECV_BITMAP
0527218572 migration: new cmd MIG_CMD_RECV_BITMAP
060b476de0 migration: wakeup dst ram-load-thread for recover
5c512af7ac migration: new state "postcopy-recover"
3c817a2d6a migration: rebuild channel on source
498feb31bf migration: pass MigrationState to migrate_init()
2bd90bc8c7 qmp: hmp: add migrate "resume" option
4310656e2e migration: allow fault thread to pause
e5403449fa migration: allow send_rq to fail
82ff14b4eb migration: allow src return path to pause
27b5a83c3a migration: allow dst vm pause on postcopy
e89132a741 migration: implement "postcopy-pause" src logic
af8b068080 migration: new postcopy-pause state
fb163f98cf migration: provide postcopy_fault_thread_notify()
b399ae9ca4 migration: reuse mis->userfault_quit_fd
fd22ce7d15 migration: better error handling with QEMUFile

Submodule 'dtc' (git://git.qemu-project.org/dtc.git) registered for path 'dtc'
Cloning into '/var/tmp/patchew-tester-tmp-3cs0psl3/src/dtc'...
Submodule path 'dtc': checked out 'e54388015af1fb4bf04d0bca99caba1074d9cc42'
  BUILD   min-glib
Cloning into 
Checking out files:  48% (2785/5781)   
Checking out files:  49% (2833/5781)   
Checking out files:  50% (2891/5781)   
Checking out files:  51% (2949/5781)   
Checking out files:  52% (3007/5781)   
Checking out files:  53% (3064/5781)   
Checking out files:  54% (3122/5781)   
Checking out files:  55% (3180/5781)   
Checking out files:  56% (3238/5781)   
Checking out files:  57% (3296/5781)   
Checking out files:  58% (3353/5781)   
Checking out files:  59% (3411/5781)   
Checking out files:  60% (3469/5781)   
Checking out files:  61% (3527/5781)   
Checking out files:  62% (3585/5781)   
Checking out files:  63% (3643/5781)   
Checking out files:  64% (3700/5781)   
Checking out files:  65% (3758/5781)   
Checking out files:  66% (3816/5781)   
Checking out files:  67% (3874/5781)   
Checking out files:  68% (3932/5781)   
Checking out files:  69% (3989/5781)   
Checking out files:  70% (4047/5781)   
Checking out files:  71% (4105/5781)   
Checking out files:  72% (4163/5781)   
Checking out files:  73% (4221/5781)   
Checking out files:  74% (4278/5781)   
Checking out files:  75% (4336/5781)   
Checking out files:  76% (4394/5781)   
Checking out files:  77% (4452/5781)   
Checking out files:  78% (4510/5781)   
Checking out files:  79% (4567/5781)   
Checking out files:  80% (4625/5781)   
Checking out files:  81% (4683/5781)   
Checking out files:  82% (4741/5781)   
Checking out files:  83% (4799/5781)   
Checking out files:  84% (4857/5781)   
Checking out files:  85% (4914/5781)   
Checking out files:  86% (4972/5781)   
Checking out files:  87% (5030/5781)   
Checking out files:  88% (5088/5781)   
Checking out files:  89% (5146/5781)   
Checking out files:  90% (5203/5781)   
Checking out files:  91% (5261/5781)   
Checking out files:  92% (5319/5781)   
Checking out files:  93% (5377/5781)   
Checking out files:  94% (5435/5781)   
Checking out files:  95% (5492/5781)   
Checking out files:  96% (5550/5781)   
Checking out files:  97% (5608/5781)   
Checking out files:  98% (5666/5781)   
Checking out files:  99% (5724/5781)   
Checking out files: 100% (5781/5781)   
Checking out files: 100% (5781/5781), done.
Your branch is up-to-date with 'origin/test'.
Submodule 'dtc' (git://git.qemu-project.org/dtc.git) registered for path 'dtc'
Cloning into 
Submodule path 'dtc': checked out 'e54388015af1fb4bf04d0bca99caba1074d9cc42'
Submodule 'ui/keycodemapdb' (git://git.qemu.org/keycodemapdb.git) registered 
for path 'ui/keycodemapdb'
Cloning into 
Submodule path 'ui/keycodemapdb': checked out 
    RUN test-build in qemu:min-glib 
Environment variables:

Configure options:
--enable-werror --target-list=x86_64-softmmu,aarch64-softmmu 
No C++ compiler available; disabling C++ specific optional code
Install prefix    /tmp/qemu-test/install
BIOS directory    /tmp/qemu-test/install/share/qemu
firmware path     /tmp/qemu-test/install/share/qemu-firmware
binary directory  /tmp/qemu-test/install/bin
library directory /tmp/qemu-test/install/lib
module directory  /tmp/qemu-test/install/lib/qemu
libexec directory /tmp/qemu-test/install/libexec
include directory /tmp/qemu-test/install/include
config directory  /tmp/qemu-test/install/etc
local state directory   /tmp/qemu-test/install/var
Manual directory  /tmp/qemu-test/install/share/man
ELF interp prefix /usr/gnemul/qemu-%M
Source path       /tmp/qemu-test/src
GIT binary        git
GIT submodules    
C compiler        cc
Host C compiler   cc
C++ compiler      
Objective-C compiler cc
ARFLAGS           rv
QEMU_CFLAGS       -I/usr/include/pixman-1   -I$(SRC_PATH)/dtc/libfdt -pthread 
-I/usr/include/glib-2.0 -I/usr/lib64/glib-2.0/include   -fPIE -DPIE -m64 -mcx16 
-Wredundant-decls -Wall -Wundef -Wwrite-strings -Wmissing-prototypes 
-fno-strict-aliasing -fno-common -fwrapv  -Wendif-labels 
-Wno-missing-include-dirs -Wempty-body -Wnested-externs -Wformat-security 
-Wformat-y2k -Winit-self -Wignored-qualifiers -Wold-style-declaration 
-Wold-style-definition -Wtype-limits -fstack-protector-all -Wno-missing-braces
LDFLAGS           -Wl,--warn-common -Wl,-z,relro -Wl,-z,now -pie -m64 -g 
make              make
install           install
python            python -B
smbd              /usr/sbin/smbd
module support    no
host CPU          x86_64
host big endian   no
target list       x86_64-softmmu aarch64-softmmu
gprof enabled     no
sparse enabled    no
strip binaries    yes
profiler          no
static build      no
SDL support       yes (1.2.14)
GTK support       no 
GTK GL support    no
VTE support       no 
TLS priority      NORMAL
GNUTLS support    no
GNUTLS rnd        no
libgcrypt         no
libgcrypt kdf     no
nettle            no 
nettle kdf        no
libtasn1          no
curses support    no
virgl support     no
curl support      no
mingw32 support   no
Audio drivers     oss
Block whitelist (rw) 
Block whitelist (ro) 
VirtFS support    no
Multipath support no
VNC support       yes
VNC SASL support  no
VNC JPEG support  no
VNC PNG support   no
xen support       no
brlapi support    no
bluez  support    no
Documentation     no
PIE               yes
vde support       no
netmap support    no
Linux AIO support no
ATTR/XATTR support yes
Install blobs     yes
KVM support       yes
HAX support       no
HVF support       no
WHPX support      no
TCG support       yes
TCG debug enabled no
TCG interpreter   no
malloc trim support yes
RDMA support      no
fdt support       yes
preadv support    yes
fdatasync         yes
madvise           yes
posix_madvise     yes
libcap-ng support no
vhost-net support yes
vhost-scsi support yes
vhost-vsock support yes
vhost-user support yes
Trace backends    log
spice support     no 
rbd support       no
xfsctl support    no
smartcard support no
libusb            no
usb net redir     no
OpenGL support    no
OpenGL dmabufs    no
libiscsi support  no
libnfs support    no
build guest agent yes
QGA VSS support   no
QGA w32 disk info no
QGA MSI support   no
seccomp support   no
coroutine backend ucontext
coroutine pool    yes
debug stack usage no
crypto afalg      no
GlusterFS support no
gcov              gcov
gcov enabled      no
TPM support       yes
libssh2 support   no
TPM passthrough   yes
TPM emulator      yes
QOM debugging     yes
Live block migration yes
lzo support       no
snappy support    no
bzip2 support     no
NUMA host support no
libxml2           no
tcmalloc support  no
jemalloc support  no
avx2 optimization no
replication support yes
VxHS block device no
capstone          no

WARNING: Use of SDL 1.2 is deprecated and will be removed in
WARNING: future releases. Please switch to using SDL 2.0
  GEN     x86_64-softmmu/config-devices.mak.tmp
  GEN     aarch64-softmmu/config-devices.mak.tmp
  GEN     config-host.h
  GEN     qemu-options.def
  GEN     qmp-commands.h
  GEN     qapi-types.h
  GEN     qapi-visit.h
  GEN     qapi-event.h
  GEN     x86_64-softmmu/config-devices.mak
  GEN     aarch64-softmmu/config-devices.mak
  GEN     qmp-marshal.c
  GEN     qapi-types.c
  GEN     qapi-visit.c
  GEN     qapi-event.c
In file included from /tmp/qemu-test/src/qapi-schema.json:91:
/tmp/qemu-test/src/qapi/migration.json:1193: Unknown key 'allow-oob' in command 
make: *** [qapi-visit.h] Error 1
make: *** Deleting file `qapi-visit.h'
make: *** Waiting for unfinished jobs....
In file included from /tmp/qemu-test/src/qapi-schema.json:91:
/tmp/qemu-test/src/qapi/migration.json:1193: Unknown key 'allow-oob' in command 
In file included from /tmp/qemu-test/src/qapi-schema.json:91:
/tmp/qemu-test/src/qapi/migration.json:1193: Unknown key 'allow-oob' in command 
In file included from /tmp/qemu-test/src/qapi-schema.json:91:
/tmp/qemu-test/src/qapi/migration.json:1193: Unknown key 'allow-oob' in command 
make: *** [qmp-commands.h] Error 1
make: *** Deleting file `qmp-commands.h'
make: *** [qapi-types.h] Error 1
make: *** Deleting file `qapi-types.h'
In file included from /tmp/qemu-test/src/qapi-schema.json:91:
/tmp/qemu-test/src/qapi/migration.json:1193: Unknown key 'allow-oob' in command 
make: *** [qapi-event.h] Error 1
make: *** Deleting file `qapi-event.h'
In file included from /tmp/qemu-test/src/qapi-schema.json:91:
/tmp/qemu-test/src/qapi/migration.json:1193: Unknown key 'allow-oob' in command 
make: *** [qmp-marshal.c] Error 1
make: *** Deleting file `qmp-marshal.c'
In file included from /tmp/qemu-test/src/qapi-schema.json:91:
/tmp/qemu-test/src/qapi/migration.json:1193: Unknown key 'allow-oob' in command 
make: *** [qapi-types.c] Error 1
make: *** Deleting file `qapi-types.c'
make: *** [qapi-visit.c] Error 1
make: *** Deleting file `qapi-visit.c'
In file included from /tmp/qemu-test/src/qapi-schema.json:91:
/tmp/qemu-test/src/qapi/migration.json:1193: Unknown key 'allow-oob' in command 
make: *** [qapi-event.c] Error 1
make: *** Deleting file `qapi-event.c'
Traceback (most recent call last):
  File "./tests/docker/docker.py", line 407, in <module>
  File "./tests/docker/docker.py", line 404, in main
    return args.cmdobj.run(args, argv)
  File "./tests/docker/docker.py", line 261, in run
    return Docker().run(argv, args.keep, quiet=args.quiet)
  File "./tests/docker/docker.py", line 229, in run
  File "./tests/docker/docker.py", line 147, in _do_check
    return subprocess.check_call(self._command + cmd, **kwargs)
  File "/usr/lib64/python2.7/subprocess.py", line 186, in check_call
    raise CalledProcessError(retcode, cmd)
subprocess.CalledProcessError: Command '['docker', 'run', '--label', 
'com.qemu.instance.uuid=58c4cc340cc311e886ad52540069c830', '-u', '0', 
'--security-opt', 'seccomp=unconfined', '--rm', '--net=none', '-e', 
'TARGET_LIST=', '-e', 'EXTRA_CONFIGURE_OPTS=', '-e', 'V=', '-e', 'J=8', '-e', 
'DEBUG=', '-e', 'SHOW_ENV=1', '-e', 'CCACHE_DIR=/var/tmp/ccache', '-v', 
'/root/.cache/qemu-docker-ccache:/var/tmp/ccache:z', '-v', 
 'qemu:min-glib', '/var/tmp/qemu/run', 'test-build']' returned non-zero exit 
status 2
make[1]: *** [tests/docker/Makefile.include:129: docker-run] Error 1
make: *** [tests/docker/Makefile.include:163: address@hidden Error 2

real    0m50.709s
user    0m4.508s
sys     0m3.098s
=== OUTPUT END ===

Test command exited with code: 2

Email generated automatically by Patchew [http://patchew.org/].
Please send your feedback to address@hidden

reply via email to

[Prev in Thread] Current Thread [Next in Thread]