qemu-devel
[Top][All Lists]
Advanced

[Date Prev][Date Next][Thread Prev][Thread Next][Date Index][Thread Index]

Re: [Qemu-devel] [PATCH 00/14] Generalize Dallas/Maxim I2C RTC devices v


From: no-reply
Subject: Re: [Qemu-devel] [PATCH 00/14] Generalize Dallas/Maxim I2C RTC devices v2
Date: Sat, 24 Mar 2018 15:08:06 -0700 (PDT)

Hi,

This series failed address@hidden build test. Please find the testing commands 
and
their output below. If you have Docker installed, you can probably reproduce it
locally.

Type: series
Message-id: address@hidden
Subject: [Qemu-devel] [PATCH 00/14] Generalize Dallas/Maxim I2C RTC devices v2

=== TEST SCRIPT BEGIN ===
#!/bin/bash
set -e
git submodule update --init dtc
# Let docker tests dump environment info
export SHOW_ENV=1
export J=8
time make address@hidden
=== TEST SCRIPT END ===

Updating 3c8cf5a9c21ff8782164d1def7f44bd888713384
Switched to a new branch 'test'
cd5d44142f tests: drop ds1338-test
c568d03629 timer: ds-rtc model ds1375
360e76e958 timer: ds-rtc handle CENTURY bit
8e600ad679 timer: generalize ds1338
43f1db5002 timer: rename file ds1338.c -> ds-rtc.c
5ec505be2e timer: rename ds1338 -> dsrtc
628ed92468 tests: ds-rtc test wday offset
2582baf810 timer: ds1338 fix wday_offset handling
793b89687b tests: ds-rtc test 12 hour mode
3f9b2eb07b timer: ds1338 change write handling
45c4df6895 timer: ds1338 clarify HOUR handling
bb5d6cd534 timer: ds1338 persist 12-hour mode selection
8291a6b22d timer: ds1338 use registerfields.h
c785175358 tests: more thorough tests of ds1338

=== OUTPUT BEGIN ===
Submodule 'dtc' (git://git.qemu-project.org/dtc.git) registered for path 'dtc'
Cloning into '/var/tmp/patchew-tester-tmp-8pwvp3st/src/dtc'...
Submodule path 'dtc': checked out 'e54388015af1fb4bf04d0bca99caba1074d9cc42'
  BUILD   min-glib
make[1]: Entering directory '/var/tmp/patchew-tester-tmp-8pwvp3st/src'
  GEN     
/var/tmp/patchew-tester-tmp-8pwvp3st/src/docker-src.2018-03-24-18.07.16.7723/qemu.tar
Cloning into 
'/var/tmp/patchew-tester-tmp-8pwvp3st/src/docker-src.2018-03-24-18.07.16.7723/qemu.tar.vroot'...
done.
Your branch is up-to-date with 'origin/test'.
Submodule 'dtc' (git://git.qemu-project.org/dtc.git) registered for path 'dtc'
Cloning into 
'/var/tmp/patchew-tester-tmp-8pwvp3st/src/docker-src.2018-03-24-18.07.16.7723/qemu.tar.vroot/dtc'...
Submodule path 'dtc': checked out 'e54388015af1fb4bf04d0bca99caba1074d9cc42'
Submodule 'ui/keycodemapdb' (git://git.qemu.org/keycodemapdb.git) registered 
for path 'ui/keycodemapdb'
Cloning into 
'/var/tmp/patchew-tester-tmp-8pwvp3st/src/docker-src.2018-03-24-18.07.16.7723/qemu.tar.vroot/ui/keycodemapdb'...
Submodule path 'ui/keycodemapdb': checked out 
'6b3d716e2b6472eb7189d3220552280ef3d832ce'
tar: 
/var/tmp/patchew-tester-tmp-8pwvp3st/src/docker-src.2018-03-24-18.07.16.7723/qemu.tar:
 Wrote only 4096 of 10240 bytes
tar: Error is not recoverable: exiting now
failed to create tar file
  COPY    RUNNER
    RUN test-build in qemu:min-glib 
tar: Unexpected EOF in archive
tar: Unexpected EOF in archive
tar: Error is not recoverable: exiting now
/var/tmp/qemu/run: line 32: prep_fail: command not found
Environment variables:
HOSTNAME=2ad891f2b17f
MAKEFLAGS= -j8
J=8
CCACHE_DIR=/var/tmp/ccache
EXTRA_CONFIGURE_OPTS=
V=
SHOW_ENV=1
PATH=/usr/lib/ccache:/usr/lib64/ccache:/usr/local/sbin:/usr/local/bin:/usr/sbin:/usr/bin:/sbin:/bin
PWD=/
TARGET_LIST=
SHLVL=1
HOME=/root
TEST_DIR=/tmp/qemu-test
FEATURES= dtc
DEBUG=
_=/usr/bin/env

Configure options:
--enable-werror --target-list=x86_64-softmmu,aarch64-softmmu 
--prefix=/tmp/qemu-test/install

ERROR: DTC (libfdt) version >= 1.4.2 not present.
       Please install the DTC (libfdt) devel package

Traceback (most recent call last):
  File "./tests/docker/docker.py", line 407, in <module>
    sys.exit(main())
  File "./tests/docker/docker.py", line 404, in main
    return args.cmdobj.run(args, argv)
  File "./tests/docker/docker.py", line 261, in run
    return Docker().run(argv, args.keep, quiet=args.quiet)
  File "./tests/docker/docker.py", line 229, in run
    quiet=quiet)
  File "./tests/docker/docker.py", line 147, in _do_check
    return subprocess.check_call(self._command + cmd, **kwargs)
  File "/usr/lib64/python2.7/subprocess.py", line 186, in check_call
    raise CalledProcessError(retcode, cmd)
subprocess.CalledProcessError: Command '['docker', 'run', '--label', 
'com.qemu.instance.uuid=c219b4d82faf11e8b99852540069c830', '-u', '0', 
'--security-opt', 'seccomp=unconfined', '--rm', '--net=none', '-e', 
'TARGET_LIST=', '-e', 'EXTRA_CONFIGURE_OPTS=', '-e', 'V=', '-e', 'J=8', '-e', 
'DEBUG=', '-e', 'SHOW_ENV=1', '-e', 'CCACHE_DIR=/var/tmp/ccache', '-v', 
'/root/.cache/qemu-docker-ccache:/var/tmp/ccache:z', '-v', 
'/var/tmp/patchew-tester-tmp-8pwvp3st/src/docker-src.2018-03-24-18.07.16.7723:/var/tmp/qemu:z,ro',
 'qemu:min-glib', '/var/tmp/qemu/run', 'test-build']' returned non-zero exit 
status 1
make[1]: *** [tests/docker/Makefile.include:129: docker-run] Error 1
make[1]: Leaving directory '/var/tmp/patchew-tester-tmp-8pwvp3st/src'
make: *** [tests/docker/Makefile.include:163: address@hidden Error 2

real    0m54.355s
user    0m8.995s
sys     0m6.886s
=== OUTPUT END ===

Test command exited with code: 2


---
Email generated automatically by Patchew [http://patchew.org/].
Please send your feedback to address@hidden

reply via email to

[Prev in Thread] Current Thread [Next in Thread]