[Top][All Lists]
[Date Prev][Date Next][Thread Prev][Thread Next][Date Index][Thread Index]
Re: [AUCTeX-devel] Error trying to build from cvs
From: |
David Kastrup |
Subject: |
Re: [AUCTeX-devel] Error trying to build from cvs |
Date: |
Thu, 08 Mar 2007 22:50:10 +0100 |
User-agent: |
Gnus/5.11 (Gnus v5.11) Emacs/22.0.95 (gnu/linux) |
Frank Küster <address@hidden> writes:
> I'm wondering what I am doing wrong here:
>
> $ cvs -z3 -d:pserver:address@hidden:/sources/auctex export -rHEAD auctex
> $ cd auctex
> auctex$ ./autogen.sh
> auctex$ ./configure
> [...]
> auctex$ make
> [...]
> /usr/bin/latex '\nonstopmode \input preview.drv'
> [...]
> (/usr/share/texmf-texlive/tex/latex/tools/multicol.sty))) (./preview.sty
> ! Use of \next doesn't match its definition.
> address@hidden ->H
> EAD
> l.33 address@hidden@version
> }}} \next \fi
> )
> No file preview.aux.
> (./preview.dtx
> [...]
> Output written on preview.dvi (28 pages, 98032 bytes).
> Transcript written on preview.log.
> make[2]: *** [preview.dvi] Error 1
> make[2]: Leaving directory
> `/home/frank/src/Packages/auctex-snapshot/auctex/preview/latex'
> make[1]: *** [texmf] Error 2
> make[1]: Leaving directory
> `/home/frank/src/Packages/auctex-snapshot/auctex/preview'
> make: *** [all] Error 2
>
> I also tried to replace HEAD with 20030308, but that didn't change
> anything.
Don't specify any revision.
--
David Kastrup, Kriemhildstr. 15, 44793 Bochum
- [AUCTeX-devel] Error trying to build from cvs, Frank Küster, 2007/03/08
- Re: [AUCTeX-devel] Error trying to build from cvs,
David Kastrup <=
- Re: [AUCTeX-devel] Error trying to build from cvs, Frank Küster, 2007/03/09
- Re: [AUCTeX-devel] Error trying to build from cvs, David Kastrup, 2007/03/09
- Re: [AUCTeX-devel] Error trying to build from cvs, Frank Küster, 2007/03/09
- Re: [AUCTeX-devel] Error trying to build from cvs, Ralf Angeli, 2007/03/09
- Re: [AUCTeX-devel] Error trying to build from cvs, Frank Küster, 2007/03/09
- [AUCTeX-devel] Re: Error trying to build from cvs, Reiner Steib, 2007/03/09
- Re: [AUCTeX-devel] Error trying to build from cvs, Ralf Angeli, 2007/03/09