[Top][All Lists]
[Date Prev][Date Next][Thread Prev][Thread Next][Date Index][Thread Index]
[Cvs-test-results] Nightly testing results for TRUNK (Power_Macintosh Da
From: |
cvstest |
Subject: |
[Cvs-test-results] Nightly testing results for TRUNK (Power_Macintosh Darwin 5.5) |
Date: |
Tue, 4 Oct 2005 01:39:52 -0400 |
Nightly test results for Mon Oct 3 22:35:14 PDT 2005
Darwin ppc-osx1 5.5 Darwin Kernel Version 5.5: Thu May 30 14:51:26 PDT 2002;
root:xnu/xnu-201.42.3.obj~1/RELEASE_PPC Power Macintosh powerpc
Please send questions/comments to address@hidden
Build failed; see
/home/users/d/de/derekrprice/nightly.Darwin.5.5.Power_Macintosh.log for details
(last 200 lines follows)
config.status: creating maint-aux/Makefile
config.status: creating man/Makefile
config.status: creating os2/Makefile
config.status: creating src/Makefile
config.status: creating src/sanity.config.sh
config.status: creating tools/Makefile
config.status: creating vms/Makefile
config.status: creating windows-NT/Makefile
config.status: creating windows-NT/SCC/Makefile
config.status: creating zlib/Makefile
config.status: creating config.h
config.status: executing depfiles commands
config.status: executing default-1 commands
You are about to use an unreleased version of CVS. Be sure to
read the relevant mailing lists, most importantly <address@hidden>.
Below you will find information on the status of this version of CVS.
* Status
This experimental version of CVS contains new features which may not have
been tested as thoroughly as the stable release. It is classified as:
/*-------------.
| Experimental |
`-------------*/
/*-------------------------.
| Sane for full scale use. |
`-------------------------*/
+ make
make all-recursive
Making all in lib
cp /home/users/d/de/derekrprice/cvs-nightly/lib/alloca_.h alloca.h-t
mv alloca.h-t alloca.h
cp /home/users/d/de/derekrprice/cvs-nightly/lib/getopt_.h getopt.h-t
mv getopt.h-t getopt.h
cp /home/users/d/de/derekrprice/cvs-nightly/lib/glob_.h glob.h-t
mv glob.h-t glob.h
sed -e 's/@''HAVE__BOOL''@/0/g' \
< /home/users/d/de/derekrprice/cvs-nightly/lib/stdbool_.h > stdbool.h-t
mv stdbool.h-t stdbool.h
make all-am
source='/home/users/d/de/derekrprice/cvs-nightly/lib/sighandle.c'
object='sighandle.o' libtool=no \
DEPDIR=.deps depmode=gcc /bin/sh
/home/users/d/de/derekrprice/cvs-nightly/build-aux/depcomp \
cc -DHAVE_CONFIG_H -I. -I/home/users/d/de/derekrprice/cvs-nightly/lib -I..
-Ino/include -g -O2 -c /home/users/d/de/derekrprice/cvs-nightly/lib/sighandle.c
./getopt.h:37: warning: could not use precompiled header
'/usr/include/unistd.p', because:
./getopt.h:37: warning: macro 're_comp' defined by ../config.h conflicts with
precomp
source='/home/users/d/de/derekrprice/cvs-nightly/lib/allocsa.c'
object='allocsa.o' libtool=no \
DEPDIR=.deps depmode=gcc /bin/sh
/home/users/d/de/derekrprice/cvs-nightly/build-aux/depcomp \
cc -DHAVE_CONFIG_H -I. -I/home/users/d/de/derekrprice/cvs-nightly/lib -I..
-Ino/include -g -O2 -c /home/users/d/de/derekrprice/cvs-nightly/lib/allocsa.c
In file included from /home/users/d/de/derekrprice/cvs-nightly/lib/allocsa.c:24:
/home/users/d/de/derekrprice/cvs-nightly/lib/allocsa.h:98: warning: use of
`long double' type; its size may change in a future release
/home/users/d/de/derekrprice/cvs-nightly/lib/allocsa.h:98: warning: (Long
double usage is reported only once for each file.
/home/users/d/de/derekrprice/cvs-nightly/lib/allocsa.h:98: warning: To disable
this warning, use -Wno-long-double.)
source='/home/users/d/de/derekrprice/cvs-nightly/lib/cycle-check.c'
object='cycle-check.o' libtool=no \
DEPDIR=.deps depmode=gcc /bin/sh
/home/users/d/de/derekrprice/cvs-nightly/build-aux/depcomp \
cc -DHAVE_CONFIG_H -I. -I/home/users/d/de/derekrprice/cvs-nightly/lib -I..
-Ino/include -g -O2 -c
/home/users/d/de/derekrprice/cvs-nightly/lib/cycle-check.c
source='/home/users/d/de/derekrprice/cvs-nightly/lib/basename.c'
object='basename.o' libtool=no \
DEPDIR=.deps depmode=gcc /bin/sh
/home/users/d/de/derekrprice/cvs-nightly/build-aux/depcomp \
cc -DHAVE_CONFIG_H -I. -I/home/users/d/de/derekrprice/cvs-nightly/lib -I..
-Ino/include -g -O2 -c /home/users/d/de/derekrprice/cvs-nightly/lib/basename.c
source='/home/users/d/de/derekrprice/cvs-nightly/lib/stripslash.c'
object='stripslash.o' libtool=no \
DEPDIR=.deps depmode=gcc /bin/sh
/home/users/d/de/derekrprice/cvs-nightly/build-aux/depcomp \
cc -DHAVE_CONFIG_H -I. -I/home/users/d/de/derekrprice/cvs-nightly/lib -I..
-Ino/include -g -O2 -c
/home/users/d/de/derekrprice/cvs-nightly/lib/stripslash.c
source='/home/users/d/de/derekrprice/cvs-nightly/lib/getnline.c'
object='getnline.o' libtool=no \
DEPDIR=.deps depmode=gcc /bin/sh
/home/users/d/de/derekrprice/cvs-nightly/build-aux/depcomp \
cc -DHAVE_CONFIG_H -I. -I/home/users/d/de/derekrprice/cvs-nightly/lib -I..
-Ino/include -g -O2 -c /home/users/d/de/derekrprice/cvs-nightly/lib/getnline.c
source='/home/users/d/de/derekrprice/cvs-nightly/lib/strnlen1.c'
object='strnlen1.o' libtool=no \
DEPDIR=.deps depmode=gcc /bin/sh
/home/users/d/de/derekrprice/cvs-nightly/build-aux/depcomp \
cc -DHAVE_CONFIG_H -I. -I/home/users/d/de/derekrprice/cvs-nightly/lib -I..
-Ino/include -g -O2 -c /home/users/d/de/derekrprice/cvs-nightly/lib/strnlen1.c
source='/home/users/d/de/derekrprice/cvs-nightly/lib/xalloc-die.c'
object='xalloc-die.o' libtool=no \
DEPDIR=.deps depmode=gcc /bin/sh
/home/users/d/de/derekrprice/cvs-nightly/build-aux/depcomp \
cc -DHAVE_CONFIG_H -I. -I/home/users/d/de/derekrprice/cvs-nightly/lib -I..
-Ino/include -g -O2 -c
/home/users/d/de/derekrprice/cvs-nightly/lib/xalloc-die.c
source='/home/users/d/de/derekrprice/cvs-nightly/lib/xgethostname.c'
object='xgethostname.o' libtool=no \
DEPDIR=.deps depmode=gcc /bin/sh
/home/users/d/de/derekrprice/cvs-nightly/build-aux/depcomp \
cc -DHAVE_CONFIG_H -I. -I/home/users/d/de/derekrprice/cvs-nightly/lib -I..
-Ino/include -g -O2 -c
/home/users/d/de/derekrprice/cvs-nightly/lib/xgethostname.c
/home/users/d/de/derekrprice/cvs-nightly/lib/xgethostname.c:31: warning: could
not use precompiled header '/usr/include/unistd.p', because:
/home/users/d/de/derekrprice/cvs-nightly/lib/xgethostname.c:31: warning: macro
're_comp' defined by ../config.h conflicts with precomp
source='/home/users/d/de/derekrprice/cvs-nightly/lib/sunos57-select.c'
object='sunos57-select.o' libtool=no \
DEPDIR=.deps depmode=gcc /bin/sh
/home/users/d/de/derekrprice/cvs-nightly/build-aux/depcomp \
cc -DHAVE_CONFIG_H -I. -I/home/users/d/de/derekrprice/cvs-nightly/lib -I..
-Ino/include -g -O2 -c
/home/users/d/de/derekrprice/cvs-nightly/lib/sunos57-select.c
/home/users/d/de/derekrprice/cvs-nightly/lib/sunos57-select.c:44: warning:
could not use precompiled header '/usr/include/unistd.p', because:
/home/users/d/de/derekrprice/cvs-nightly/lib/sunos57-select.c:44: warning:
macro 're_comp' defined by ../config.h conflicts with precomp
source='/home/users/d/de/derekrprice/cvs-nightly/lib/save-cwd.c'
object='save-cwd.o' libtool=no \
DEPDIR=.deps depmode=gcc /bin/sh
/home/users/d/de/derekrprice/cvs-nightly/build-aux/depcomp \
cc -DHAVE_CONFIG_H -I. -I/home/users/d/de/derekrprice/cvs-nightly/lib -I..
-Ino/include -g -O2 -c /home/users/d/de/derekrprice/cvs-nightly/lib/save-cwd.c
/home/users/d/de/derekrprice/cvs-nightly/lib/save-cwd.c:32: warning: could not
use precompiled header '/usr/include/unistd.p', because:
/home/users/d/de/derekrprice/cvs-nightly/lib/save-cwd.c:32: warning: macro
're_comp' defined by ../config.h conflicts with precomp
source='/home/users/d/de/derekrprice/cvs-nightly/lib/mktime.c'
object='mktime.o' libtool=no \
DEPDIR=.deps depmode=gcc /bin/sh
/home/users/d/de/derekrprice/cvs-nightly/build-aux/depcomp \
cc -DHAVE_CONFIG_H -I. -I/home/users/d/de/derekrprice/cvs-nightly/lib -I..
-Ino/include -g -O2 -c /home/users/d/de/derekrprice/cvs-nightly/lib/mktime.c
source='/home/users/d/de/derekrprice/cvs-nightly/lib/strftime.c'
object='strftime.o' libtool=no \
DEPDIR=.deps depmode=gcc /bin/sh
/home/users/d/de/derekrprice/cvs-nightly/build-aux/depcomp \
cc -DHAVE_CONFIG_H -I. -I/home/users/d/de/derekrprice/cvs-nightly/lib -I..
-Ino/include -g -O2 -c /home/users/d/de/derekrprice/cvs-nightly/lib/strftime.c
source='/home/users/d/de/derekrprice/cvs-nightly/lib/canon-host.c'
object='canon-host.o' libtool=no \
DEPDIR=.deps depmode=gcc /bin/sh
/home/users/d/de/derekrprice/cvs-nightly/build-aux/depcomp \
cc -DHAVE_CONFIG_H -I. -I/home/users/d/de/derekrprice/cvs-nightly/lib -I..
-Ino/include -g -O2 -c
/home/users/d/de/derekrprice/cvs-nightly/lib/canon-host.c
/usr/include/sys/socket.h:176: undefined type, found `u_char'
/usr/include/sys/socket.h:177: undefined type, found `u_char'
/usr/include/sys/socket.h:187: undefined type, found `u_short'
/usr/include/sys/socket.h:188: undefined type, found `u_short'
/usr/include/sys/socket.h:202: undefined type, found `u_char'
/usr/include/sys/socket.h:203: undefined type, found `u_char'
/usr/include/sys/socket.h:205: undefined type, found `int64_t'
/usr/include/sys/socket.h:328: undefined type, found `caddr_t'
/usr/include/sys/socket.h:329: undefined type, found `u_int'
/usr/include/sys/socket.h:331: undefined type, found `u_int'
/usr/include/sys/socket.h:332: undefined type, found `caddr_t'
/usr/include/sys/socket.h:333: undefined type, found `u_int'
/usr/include/sys/socket.h:360: undefined type, found `u_int'
/usr/include/sys/socket.h:396: undefined type, found `u_short'
/usr/include/sys/socket.h:404: undefined type, found `caddr_t'
/usr/include/sys/socket.h:408: undefined type, found `caddr_t'
/usr/include/sys/socket.h:443: undefined type, found `ssize_t'
/usr/include/sys/socket.h:443: syntax error, found `size_t'
/usr/include/sys/socket.h:443: illegal function definition, found `)'
/usr/include/sys/socket.h:444: undefined type, found `ssize_t'
/usr/include/sys/socket.h:444: syntax error, found `size_t'
/usr/include/sys/socket.h:444: illegal function definition, found `)'
/usr/include/sys/socket.h:445: undefined type, found `ssize_t'
/usr/include/sys/socket.h:446: undefined type, found `ssize_t'
/usr/include/sys/socket.h:446: syntax error, found `size_t'
/usr/include/sys/socket.h:446: illegal function definition, found `)'
/usr/include/sys/socket.h:447: undefined type, found `ssize_t'
/usr/include/sys/socket.h:447: syntax error, found `size_t'
/usr/include/sys/socket.h:447: illegal function definition, found `)'
/usr/include/sys/socket.h:449: undefined type, found `ssize_t'
cpp-precomp: warning: errors during smart preprocessing, retrying in basic mode
In file included from
/home/users/d/de/derekrprice/cvs-nightly/lib/getaddrinfo.h:24,
from
/home/users/d/de/derekrprice/cvs-nightly/lib/canon-host.c:27:
/usr/include/sys/socket.h:176: parse error before `u_char'
/usr/include/sys/socket.h:176: warning: no semicolon at end of struct or union
/usr/include/sys/socket.h:177: warning: data definition has no type or storage
class
/usr/include/sys/socket.h:179: parse error before `}'
/usr/include/sys/socket.h:187: parse error before `u_short'
/usr/include/sys/socket.h:187: warning: no semicolon at end of struct or union
/usr/include/sys/socket.h:188: warning: data definition has no type or storage
class
/usr/include/sys/socket.h:202: parse error before `u_char'
/usr/include/sys/socket.h:202: warning: no semicolon at end of struct or union
/usr/include/sys/socket.h:203: warning: data definition has no type or storage
class
/usr/include/sys/socket.h:204: `int64_t' undeclared here (not in a function)
/usr/include/sys/socket.h:204: `u_char' undeclared here (not in a function)
/usr/include/sys/socket.h:204: size of array `_ss_pad1' is negative
/usr/include/sys/socket.h:205: parse error before `_ss_align'
/usr/include/sys/socket.h:205: warning: data definition has no type or storage
class
/usr/include/sys/socket.h:206: `u_char' undeclared here (not in a function)
/usr/include/sys/socket.h:206: `int64_t' undeclared here (not in a function)
/usr/include/sys/socket.h:206: `u_char' undeclared here (not in a function)
/usr/include/sys/socket.h:206: `int64_t' undeclared here (not in a function)
/usr/include/sys/socket.h:207: parse error before `}'
/usr/include/sys/socket.h:328: parse error before `caddr_t'
/usr/include/sys/socket.h:328: warning: no semicolon at end of struct or union
/usr/include/sys/socket.h:329: warning: data definition has no type or storage
class
/usr/include/sys/socket.h:331: parse error before `msg_iovlen'
/usr/include/sys/socket.h:331: warning: data definition has no type or storage
class
/usr/include/sys/socket.h:332: parse error before `msg_control'
/usr/include/sys/socket.h:332: warning: data definition has no type or storage
class
/usr/include/sys/socket.h:333: parse error before `msg_controllen'
/usr/include/sys/socket.h:333: warning: data definition has no type or storage
class
/usr/include/sys/socket.h:335: parse error before `}'
/usr/include/sys/socket.h:360: parse error before `u_int'
/usr/include/sys/socket.h:360: warning: no semicolon at end of struct or union
/usr/include/sys/socket.h:364: parse error before `}'
/usr/include/sys/socket.h:396: parse error before `u_short'
/usr/include/sys/socket.h:396: warning: no semicolon at end of struct or union
/usr/include/sys/socket.h:398: parse error before `}'
/usr/include/sys/socket.h:404: parse error before `caddr_t'
/usr/include/sys/socket.h:404: warning: no semicolon at end of struct or union
/usr/include/sys/socket.h:408: parse error before `msg_accrights'
/usr/include/sys/socket.h:408: warning: data definition has no type or storage
class
/usr/include/sys/socket.h:410: parse error before `}'
In file included from
/home/users/d/de/derekrprice/cvs-nightly/lib/getaddrinfo.h:24,
from
/home/users/d/de/derekrprice/cvs-nightly/lib/canon-host.c:27:
/usr/include/sys/socket.h:443: parse error before `recv'
/usr/include/sys/socket.h:443: parse error before `size_t'
/usr/include/sys/socket.h:443: warning: data definition has no type or storage
class
/usr/include/sys/socket.h:444: parse error before `recvfrom'
/usr/include/sys/socket.h:444: parse error before `size_t'
/usr/include/sys/socket.h:444: warning: data definition has no type or storage
class
/usr/include/sys/socket.h:445: parse error before `recvmsg'
/usr/include/sys/socket.h:445: warning: data definition has no type or storage
class
/usr/include/sys/socket.h:446: parse error before `send'
/usr/include/sys/socket.h:446: parse error before `size_t'
/usr/include/sys/socket.h:446: warning: data definition has no type or storage
class
/usr/include/sys/socket.h:447: parse error before `sendto'
/usr/include/sys/socket.h:447: parse error before `size_t'
/usr/include/sys/socket.h:448: warning: data definition has no type or storage
class
/usr/include/sys/socket.h:449: parse error before `sendmsg'
/usr/include/sys/socket.h:449: warning: data definition has no type or storage
class
make[3]: *** [canon-host.o] Error 1
make[2]: *** [all] Error 2
make[1]: *** [all-recursive] Error 1
make: *** [all] Error 2
+ echo 'Build failed; see
/home/users/d/de/derekrprice/nightly.Darwin.5.5.Power_Macintosh.log for details'
+ echo '(last 200 lines follows)'
+ echo
+ tail -200 /home/users/d/de/derekrprice/nightly.Darwin.5.5.Power_Macintosh.log