[Top][All Lists]
[Date Prev][Date Next][Thread Prev][Thread Next][Date Index][Thread Index]
[Cvs-test-results] Nightly testing results for signed-commits3 (x86_64 L
From: |
cvstest |
Subject: |
[Cvs-test-results] Nightly testing results for signed-commits3 (x86_64 Linux 2.6.9-1.667smp) |
Date: |
Wed, 18 Jan 2006 04:02:48 -0500 |
Nightly test results for Wed Jan 18 01:00:39 PST 2006
Linux amd64-linux1.sourceforge.net 2.6.9-1.667smp #1 SMP Tue Nov 2 15:09:11 EST
2004 x86_64 x86_64 x86_64 GNU/Linux
Please send questions/comments to address@hidden
/bin/sh /home/users/d/de/derekrprice/cvs-nightly-signed-commits3/src/sanity.sh
`pwd`/cvs
This test should produce no other output than this message, and a final "OK".
(Note that the test can take an hour or more to run and periodically stops
for as long as one minute. Do not assume there is a problem just because
nothing seems to happen for a long time. If you cannot live without
running status, try the command: `tail -f check.log' from another window.)
FAIL: init-1
*** Please see the `TESTS' and `check.log' files for more information.
make: *** [localcheck] Error 1
Command exited with non-zero status 2
0.23user 0.27system 0:00.79elapsed 64%CPU (0avgtext+0avgdata 0maxresident)k
0inputs+0outputs (2major+29804minor)pagefaults 0swaps
PASS: awk_tooltest2 /usr/bin/gawk
Using AWK=/usr/bin/gawk
gpg: failed to create temporary file
`/tmp/build-cvs-nightly-signed-commits3/cvs-sanity-signed-commits3/home/.gnupg/.#lk0x552ac56300.amd64-linux1.sourceforge.net.18722':
No such file or directory
gpg: keyblock resource
`/tmp/build-cvs-nightly-signed-commits3/cvs-sanity-signed-commits3/home/.gnupg/pubring.gpg':
general error
gpg: failed to create temporary file
`/tmp/build-cvs-nightly-signed-commits3/cvs-sanity-signed-commits3/home/.gnupg/.#lk0x552ac56300.amd64-linux1.sourceforge.net.18723':
No such file or directory
gpg: keyblock resource
`/tmp/build-cvs-nightly-signed-commits3/cvs-sanity-signed-commits3/home/.gnupg/secring.gpg':
general error
gpg: failed to create temporary file
`/tmp/build-cvs-nightly-signed-commits3/cvs-sanity-signed-commits3/home/.gnupg/.#lk0x552ac56300.amd64-linux1.sourceforge.net.18723':
No such file or directory
gpg: keyblock resource
`/tmp/build-cvs-nightly-signed-commits3/cvs-sanity-signed-commits3/home/.gnupg/pubring.gpg':
general error
gpg: no writable keyring found: eof
gpg: error reading `-': general error
gpg: import from `-' failed: general error
gpg: Total number processed: 0
gpg: failed to create temporary file
`/tmp/build-cvs-nightly-signed-commits3/cvs-sanity-signed-commits3/home/.gnupg/.#lk0x552ac56300.amd64-linux1.sourceforge.net.18738':
No such file or directory
gpg: keyblock resource
`/tmp/build-cvs-nightly-signed-commits3/cvs-sanity-signed-commits3/home/.gnupg/secring.gpg':
general error
gpg: failed to create temporary file
`/tmp/build-cvs-nightly-signed-commits3/cvs-sanity-signed-commits3/home/.gnupg/.#lk0x552ac56300.amd64-linux1.sourceforge.net.18738':
No such file or directory
gpg: keyblock resource
`/tmp/build-cvs-nightly-signed-commits3/cvs-sanity-signed-commits3/home/.gnupg/pubring.gpg':
general error
gpg: no default secret keyring: eof
gpg: error reading `-': general error
gpg: import from `-' failed: general error
gpg: Total number processed: 0
gpg: secret keys read: 1
gpg: failed to create temporary file
`/tmp/build-cvs-nightly-signed-commits3/cvs-sanity-signed-commits3/home/.gnupg/.#lk0x552ac56300.amd64-linux1.sourceforge.net.18739':
No such file or directory
gpg: keyblock resource
`/tmp/build-cvs-nightly-signed-commits3/cvs-sanity-signed-commits3/home/.gnupg/secring.gpg':
general error
gpg: failed to create temporary file
`/tmp/build-cvs-nightly-signed-commits3/cvs-sanity-signed-commits3/home/.gnupg/.#lk0x552ac56300.amd64-linux1.sourceforge.net.18739':
No such file or directory
gpg: keyblock resource
`/tmp/build-cvs-nightly-signed-commits3/cvs-sanity-signed-commits3/home/.gnupg/pubring.gpg':
general error
gpg:
/tmp/build-cvs-nightly-signed-commits3/cvs-sanity-signed-commits3/home/.gnupg:
directory created
gpg: new configuration file
`/tmp/build-cvs-nightly-signed-commits3/cvs-sanity-signed-commits3/home/.gnupg/gpg.conf'
created
gpg: WARNING: options in
`/tmp/build-cvs-nightly-signed-commits3/cvs-sanity-signed-commits3/home/.gnupg/gpg.conf'
are not yet active during this run
gpg: fatal:
/tmp/build-cvs-nightly-signed-commits3/cvs-sanity-signed-commits3/home/.gnupg:
directory does not exist!
secmem usage: 0/0 bytes in 0/0 blocks of pool 0/32768
gpg: keyring
`/tmp/build-cvs-nightly-signed-commits3/cvs-sanity-signed-commits3/home/.gnupg/secring.gpg'
created
gpg: keyring
`/tmp/build-cvs-nightly-signed-commits3/cvs-sanity-signed-commits3/home/.gnupg/pubring.gpg'
created
gpg: no default secret key: secret key not available
gpg: signing failed: secret key not available
cvs [init aborted]: sign program exited with error code 2
exit status was 1
FAIL: init-1
/bin/sh /home/users/d/de/derekrprice/cvs-nightly-signed-commits3/src/sanity.sh
-r `pwd`/cvs
This test should produce no other output than this message, and a final "OK".
(Note that the test can take an hour or more to run and periodically stops
for as long as one minute. Do not assume there is a problem just because
nothing seems to happen for a long time. If you cannot live without
running status, try the command: `tail -f check.log' from another window.)
FAIL: init-1
*** Please see the `TESTS' and `check.log' files for more information.
make: *** [remotecheck] Error 1
Command exited with non-zero status 2
0.24user 0.28system 0:00.65elapsed 80%CPU (0avgtext+0avgdata 0maxresident)k
0inputs+0outputs (0major+32525minor)pagefaults 0swaps
PASS: awk_tooltest2 /usr/bin/gawk
Using AWK=/usr/bin/gawk
gpg: failed to create temporary file
`/tmp/build-cvs-nightly-signed-commits3/cvs-sanity-signed-commits3/home/.gnupg/.#lk0x552ac56300.amd64-linux1.sourceforge.net.19036':
No such file or directory
gpg: keyblock resource
`/tmp/build-cvs-nightly-signed-commits3/cvs-sanity-signed-commits3/home/.gnupg/pubring.gpg':
general error
gpg: failed to create temporary file
`/tmp/build-cvs-nightly-signed-commits3/cvs-sanity-signed-commits3/home/.gnupg/.#lk0x552ac56300.amd64-linux1.sourceforge.net.19038':
No such file or directory
gpg: keyblock resource
`/tmp/build-cvs-nightly-signed-commits3/cvs-sanity-signed-commits3/home/.gnupg/secring.gpg':
general error
gpg: failed to create temporary file
`/tmp/build-cvs-nightly-signed-commits3/cvs-sanity-signed-commits3/home/.gnupg/.#lk0x552ac56300.amd64-linux1.sourceforge.net.19038':
No such file or directory
gpg: keyblock resource
`/tmp/build-cvs-nightly-signed-commits3/cvs-sanity-signed-commits3/home/.gnupg/pubring.gpg':
general error
gpg: no writable keyring found: eof
gpg: error reading `-': general error
gpg: import from `-' failed: general error
gpg: Total number processed: 0
gpg: failed to create temporary file
`/tmp/build-cvs-nightly-signed-commits3/cvs-sanity-signed-commits3/home/.gnupg/.#lk0x552ac56300.amd64-linux1.sourceforge.net.19043':
No such file or directory
gpg: keyblock resource
`/tmp/build-cvs-nightly-signed-commits3/cvs-sanity-signed-commits3/home/.gnupg/secring.gpg':
general error
gpg: failed to create temporary file
`/tmp/build-cvs-nightly-signed-commits3/cvs-sanity-signed-commits3/home/.gnupg/.#lk0x552ac56300.amd64-linux1.sourceforge.net.19043':
No such file or directory
gpg: keyblock resource
`/tmp/build-cvs-nightly-signed-commits3/cvs-sanity-signed-commits3/home/.gnupg/pubring.gpg':
general error
gpg: no default secret keyring: eof
gpg: error reading `-': general error
gpg: import from `-' failed: general error
gpg: Total number processed: 0
gpg: secret keys read: 1
gpg: failed to create temporary file
`/tmp/build-cvs-nightly-signed-commits3/cvs-sanity-signed-commits3/home/.gnupg/.#lk0x552ac56300.amd64-linux1.sourceforge.net.19046':
No such file or directory
gpg: keyblock resource
`/tmp/build-cvs-nightly-signed-commits3/cvs-sanity-signed-commits3/home/.gnupg/secring.gpg':
general error
gpg: failed to create temporary file
`/tmp/build-cvs-nightly-signed-commits3/cvs-sanity-signed-commits3/home/.gnupg/.#lk0x552ac56300.amd64-linux1.sourceforge.net.19046':
No such file or directory
gpg: keyblock resource
`/tmp/build-cvs-nightly-signed-commits3/cvs-sanity-signed-commits3/home/.gnupg/pubring.gpg':
general error
gpg:
/tmp/build-cvs-nightly-signed-commits3/cvs-sanity-signed-commits3/home/.gnupg:
directory created
gpg: new configuration file
`/tmp/build-cvs-nightly-signed-commits3/cvs-sanity-signed-commits3/home/.gnupg/gpg.conf'
created
gpg: WARNING: options in
`/tmp/build-cvs-nightly-signed-commits3/cvs-sanity-signed-commits3/home/.gnupg/gpg.conf'
are not yet active during this run
gpg: fatal:
/tmp/build-cvs-nightly-signed-commits3/cvs-sanity-signed-commits3/home/.gnupg:
directory does not exist!
secmem usage: 0/0 bytes in 0/0 blocks of pool 0/32768
gpg: keyring
`/tmp/build-cvs-nightly-signed-commits3/cvs-sanity-signed-commits3/home/.gnupg/secring.gpg'
created
gpg: keyring
`/tmp/build-cvs-nightly-signed-commits3/cvs-sanity-signed-commits3/home/.gnupg/pubring.gpg'
created
gpg: no default secret key: secret key not available
gpg: signing failed: secret key not available
cvs [init aborted]: sign program exited with error code 2
exit status was 1
FAIL: init-1
- [Cvs-test-results] Nightly testing results for signed-commits3 (x86_64 Linux 2.6.9-1.667smp), cvstest, 2006/01/10
- [Cvs-test-results] Nightly testing results for signed-commits3 (x86_64 Linux 2.6.9-1.667smp), cvstest, 2006/01/11
- [Cvs-test-results] Nightly testing results for signed-commits3 (x86_64 Linux 2.6.9-1.667smp), cvstest, 2006/01/12
- [Cvs-test-results] Nightly testing results for signed-commits3 (x86_64 Linux 2.6.9-1.667smp), cvstest, 2006/01/13
- [Cvs-test-results] Nightly testing results for signed-commits3 (x86_64 Linux 2.6.9-1.667smp), cvstest, 2006/01/14
- [Cvs-test-results] Nightly testing results for signed-commits3 (x86_64 Linux 2.6.9-1.667smp), cvstest, 2006/01/15
- [Cvs-test-results] Nightly testing results for signed-commits3 (x86_64 Linux 2.6.9-1.667smp), cvstest, 2006/01/16
- [Cvs-test-results] Nightly testing results for signed-commits3 (x86_64 Linux 2.6.9-1.667smp), cvstest, 2006/01/17
- [Cvs-test-results] Nightly testing results for signed-commits3 (x86_64 Linux 2.6.9-1.667smp),
cvstest <=
- [Cvs-test-results] Nightly testing results for signed-commits3 (x86_64 Linux 2.6.9-1.667smp), cvstest, 2006/01/19
- [Cvs-test-results] Nightly testing results for signed-commits3 (x86_64 Linux 2.6.9-1.667smp), cvstest, 2006/01/20
- [Cvs-test-results] Nightly testing results for signed-commits3 (x86_64 Linux 2.6.9-1.667smp), cvstest, 2006/01/21
- [Cvs-test-results] Nightly testing results for signed-commits3 (x86_64 Linux 2.6.9-1.667smp), cvstest, 2006/01/22
- [Cvs-test-results] Nightly testing results for signed-commits3 (x86_64 Linux 2.6.9-1.667smp), cvstest, 2006/01/23
- [Cvs-test-results] Nightly testing results for signed-commits3 (x86_64 Linux 2.6.9-1.667smp), cvstest, 2006/01/24
- [Cvs-test-results] Nightly testing results for signed-commits3 (x86_64 Linux 2.6.9-1.667smp), cvstest, 2006/01/25
- [Cvs-test-results] Nightly testing results for signed-commits3 (x86_64 Linux 2.6.9-1.667smp), cvstest, 2006/01/26
- [Cvs-test-results] Nightly testing results for signed-commits3 (x86_64 Linux 2.6.9-1.667smp), cvstest, 2006/01/27
- [Cvs-test-results] Nightly testing results for signed-commits3 (x86_64 Linux 2.6.9-1.667smp), cvstest, 2006/01/28