[Date Prev][Date Next][Thread Prev][Thread Next][Date Index][Thread Index]
Sway - a wayland i3 compatible compositor [RFC]
From: |
contact . ng0 |
Subject: |
Sway - a wayland i3 compatible compositor [RFC] |
Date: |
Tue, 31 Jan 2017 20:07:12 +0000 |
Right now I'm stuck at the manpage generation of sway, the dependencies are
alright.
Error message below. Help is welcome :)
-- Configuring done
-- Generating done
-- Build files have been written to: /tmp/guix-build-sway-0.11.drv-0/build
phase `configure' succeeded after 2.8 seconds
starting phase `patch-generated-file-shebangs'
phase `patch-generated-file-shebangs' succeeded after 0.1 seconds
starting phase `build'
/gnu/store/naf2x6wm8f2y2gh7m576q9ggdw98bl2h-cmake-3.6.1/bin/cmake
-H/tmp/guix-build-sway-0.11.drv-0/sway-0.11
-B/tmp/guix-build-sway-0.11.drv-0/build --check-build-system
CMakeFiles/Makefile.cmake 0
/gnu/store/naf2x6wm8f2y2gh7m576q9ggdw98bl2h-cmake-3.6.1/bin/cmake -E
cmake_progress_start /tmp/guix-build-sway-0.11.drv-0/build/CMakeFiles
/tmp/guix-build-sway-0.11.drv-0/build/CMakeFiles/progress.marks
make -f CMakeFiles/Makefile2 all
make[1]: Entering directory '/tmp/guix-build-sway-0.11.drv-0/build'
make -f swaylock/CMakeFiles/man-swaylock.1.dir/build.make
swaylock/CMakeFiles/man-swaylock.1.dir/depend
make -f sway/CMakeFiles/man-sway.1.dir/build.make
sway/CMakeFiles/man-sway.1.dir/depend
make[2]: Entering directory '/tmp/guix-build-sway-0.11.drv-0/build'
cd /tmp/guix-build-sway-0.11.drv-0/build &&
/gnu/store/naf2x6wm8f2y2gh7m576q9ggdw98bl2h-cmake-3.6.1/bin/cmake -E
cmake_depends "Unix Makefiles" /tmp/guix-build-sway-0.11.drv-0/sway-0.11
/tmp/guix-build-sway-0.11.drv-0/sway-0.11/sway
/tmp/guix-build-sway-0.11.drv-0/build
/tmp/guix-build-sway-0.11.drv-0/build/sway
/tmp/guix-build-sway-0.11.drv-0/build/sway/CMakeFiles/man-sway.1.dir/DependInfo.cmake
--color=
make[2]: Entering directory '/tmp/guix-build-sway-0.11.drv-0/build'
cd /tmp/guix-build-sway-0.11.drv-0/build &&
/gnu/store/naf2x6wm8f2y2gh7m576q9ggdw98bl2h-cmake-3.6.1/bin/cmake -E
cmake_depends "Unix Makefiles" /tmp/guix-build-sway-0.11.drv-0/sway-0.11
/tmp/guix-build-sway-0.11.drv-0/sway-0.11/swaylock
/tmp/guix-build-sway-0.11.drv-0/build
/tmp/guix-build-sway-0.11.drv-0/build/swaylock
/tmp/guix-build-sway-0.11.drv-0/build/swaylock/CMakeFiles/man-swaylock.1.dir/DependInfo.cmake
--color=
Scanning dependencies of target man-swaylock.1
Scanning dependencies of target man-sway.1
make[2]: Leaving directory '/tmp/guix-build-sway-0.11.drv-0/build'
make[2]: Leaving directory '/tmp/guix-build-sway-0.11.drv-0/build'
make -f swaylock/CMakeFiles/man-swaylock.1.dir/build.make
swaylock/CMakeFiles/man-swaylock.1.dir/build
make[2]: Leaving directory '/tmp/guix-build-sway-0.11.drv-0/build'
make -f sway/CMakeFiles/man-sway.1.dir/build.make
sway/CMakeFiles/man-sway.1.dir/build
make[2]: Entering directory '/tmp/guix-build-sway-0.11.drv-0/build'
make[2]: Entering directory '/tmp/guix-build-sway-0.11.drv-0/build'
[ 0%] swaylock.1
[ 0%] sway.1
cd /tmp/guix-build-sway-0.11.drv-0/build/swaylock &&
/gnu/store/3kcgfgldv1ypvw7gr5xvqldd72xzrkpi-asciidoc-8.6.9/bin/a2x --no-xmllint
--doctype manpage --format
manpage -D /tmp/guix-build-sway-0.11.drv-0/build/bin
/tmp/guix-build-sway-0.11.drv-0/sway-0.11/swaylock/swaylock.1.txt
cd /tmp/guix-build-sway-0.11.drv-0/build/sway &&
/gnu/store/3kcgfgldv1ypvw7gr5xvqldd72xzrkpi-asciidoc-8.6.9/bin/a2x --no-xmllint
--doctype manpage --format manpage -D /tmp/guix-build-sway-0.11.drv-0/build/bin
/tmp/guix-build-sway-0.11.drv-0/sway-0.11/sway/sway.1.txt
a2x: WARNING: --destination-dir option is only applicable to HTML based outputs
a2x: WARNING: --destination-dir option is only applicable to HTML based outputs
a2x: ERROR: "xsltproc" --stringparam callout.graphics 0 --stringparam
navig.graphics 0 --stringparam admon.textlabel 1 --stringparam admon.graphics 0
"/gnu/store/3kcgfgldv1ypvw7gr5xvqldd72xzrkpi-asciidoc-8.6.9/etc/asciidoc/docbook-xsl/manpage.xsl"
"/tmp/guix-build-sway-0.11.drv-0/build/bin/swaylock.1.xml" returned non-zero
exit status 127
make[2]: *** [swaylock/CMakeFiles/man-swaylock.1.dir/build.make:64:
bin/swaylock.1] Error 1
make[2]: Leaving directory '/tmp/guix-build-sway-0.11.drv-0/build'
make[1]: *** [CMakeFiles/Makefile2:918:
swaylock/CMakeFiles/man-swaylock.1.dir/all] Error 2
make[1]: *** Waiting for unfinished jobs....
a2x: ERROR: "xsltproc" --stringparam callout.graphics 0 --stringparam
navig.graphics 0 --stringparam admon.textlabel 1 --stringparam admon.graphics 0
"/gnu/store/3kcgfgldv1ypvw7gr5xvqldd72xzrkpi-asciidoc-8.6.9/etc/asciidoc/docbook-xsl/manpage.xsl"
"/tmp/guix-build-sway-0.11.drv-0/build/bin/sway.1.xml" returned non-zero exit
status 127
make[2]: *** [sway/CMakeFiles/man-sway.1.dir/build.make:64: bin/sway.1] Error 1
make[2]: Leaving directory '/tmp/guix-build-sway-0.11.drv-0/build'
make[1]: *** [CMakeFiles/Makefile2:347: sway/CMakeFiles/man-sway.1.dir/all]
Error 2
make[1]: Leaving directory '/tmp/guix-build-sway-0.11.drv-0/build'
make: *** [Makefile:131: all] Error 2
phase `build' failed after 0.8 seconds
builder for `/gnu/store/1ixx04crssnb3nmxabmwykq0jzvycrld-sway-0.11.drv' failed
with exit code 1
@ build-failed /gnu/store/1ixx04crssnb3nmxabmwykq0jzvycrld-sway-0.11.drv - 1
builder for `/gnu/store/1ixx04crssnb3nmxabmwykq0jzvycrld-sway-0.11.drv' failed
with exit code 1
guix build: error: build failed: build of
`/gnu/store/1ixx04crssnb3nmxabmwykq0jzvycrld-sway-0.11.drv' failed
- Sway - a wayland i3 compatible compositor [RFC],
contact . ng0 <=