Hi people !
I'm developing on PDK and I've problems with the
libXfont.
The terminal log
is:
---------------------------------------------------------------------------------------------------------------------------------------------------------------------------------------------------------------------------------------------------------------
make[3]:
Leaving directory
`/home/eduardo/PDK/ltib-imx31modular-20080102/rpm/BUILD/libXfont-1.3.3/src/Speedo'
make[3]:
Entering directory
`/home/eduardo/PDK/ltib-imx31modular-20080102/rpm/BUILD/libXfont-1.3.3/src'
/bin/bash
../libtool --tag=CC --mode=link gcc -Wall -Wpointer-arith
-Wstrict-prototypes -Wmissing-prototypes
-Wmissing-declarations -Wnested-externs
-fno-strict-aliasing -g -O2 -D_BSD_SOURCE -DHAS_FCHOWN -DHAS_STICKY_DIR_BIT
-I/home/eduardo/PDK/ltib-imx31modular-20080102/rootfs/usr/include
-D_XOPEN_SOURCE -version-number 1:4:1 -no-undefined -o libXfont.la -rpath
/usr/lib dummy.lo fontfile/
libfontfile.la
FreeType/
libft.la bitmap/
libbitmap.la builtins/
libbuiltins.la fc/
libfc.la util/
libutil.la stubs/
libstubs.la fontcache/
libfontcache.la Type1/
libtype1.la Speedo/
libspeedo.la -lfreetype -lz -lz
-lm
-L/home/eduardo/PDK/ltib-imx31modular-20080102/rootfs/usr/lib -lfontenc
gcc
-shared .libs/dummy.o -Wl,--whole-archive fontfile/.libs/libfontfile.a
FreeType/.libs/libft.a bitmap/.libs/libbitmap.a builtins/.libs/libbuiltins.a
fc/.libs/libfc.a util/.libs/libutil.a stubs/.libs/libstubs.a
fontcache/.libs/libfontcache.a Type1/.libs/libtype1.a Speedo/.libs/libspeedo.a
-Wl,--no-whole-archive
-L/home/eduardo/PDK/ltib-imx31modular-20080102/rootfs/usr/lib
/usr/lib/libfreetype.so -lz -lm -lfontenc -Wl,-soname -Wl,libXfont.so.1 -o
.libs/libXfont.so.1.4.1
/usr/lib/libfreetype.so: could not read symbols: File
in wrong format
collect2: ld returned 1 exit status
make[3]: ***
[libXfont.la] Error 1
make[3]: Leaving directory
`/home/eduardo/PDK/ltib-imx31modular-20080102/rpm/BUILD/libXfont-1.3.3/src'
make[2]:
*** [all-recursive] Error 1
make[2]: Leaving directory
`/home/eduardo/PDK/ltib-imx31modular-20080102/rpm/BUILD/libXfont-1.3.3/src'
make[1]:
*** [all-recursive] Error 1
make[1]: Leaving directory
`/home/eduardo/PDK/ltib-imx31modular-20080102/rpm/BUILD/libXfont-1.3.3'
make:
*** [all] Error 2
error: Bad exit status from
/home/eduardo/PDK/ltib-imx31modular-20080102/tmp/rpm-tmp.46264
(%build)
RPM build errors:
Bad exit status from
/home/eduardo/PDK/ltib-imx31modular-20080102/tmp/rpm-tmp.46264 (%build)
Build
time for libXfont: 9 seconds
Failed building
libXfont
---------------------------------------------------------------------------------------------------------------------------------------------------------------------------------------------------------------------------------------------------------------
Does
anyone could help me to solve the problem ?!
Thank you,
Eduardo
Silva
www.ihouse.com.br