[Top][All Lists]
[Date Prev][Date Next][Thread Prev][Thread Next][Date Index][Thread Index]
[Ltib] ncurses or .gvfs failed?
From: |
Daniel.Li |
Subject: |
[Ltib] ncurses or .gvfs failed? |
Date: |
Thu, 09 Jul 2009 21:29:15 +0800 |
Dear List,
I have got this in host_config.log, it seems there is something wrong
with .gvfs, but it's really nothing to do with ltib. Is there anyone
familiar with this error?
And from output, we have LOG 2, see below for details, it says,
ncurses-5.3 can't be successfully compiled. Did anyone meet this before?
Really no idea about how this BSP works? Any help is really appreciated.
Thanks in advance.
LOG 1:
sudo /opt/freescale/ltib/usr/bin/rpm --root /
--dbpath /opt/freescale/ltib/var/lib/rpm -e --allmatches --nodeps
--define '_tmppath /home/daniel/work/ltib-mpc837xerdb-20081113/tmp'
sparse 2>/dev/null
sudo /opt/freescale/ltib/usr/bin/rpm --root /
--dbpath /opt/freescale/ltib/var/lib/rpm --prefix / --ignorearch -ivh
--replacepkgs --replacefiles --nodeps --excludedocs --define
'_tmppath /home/daniel/work/ltib-mpc837xerdb-20081113/tmp'
/opt/freescale/ltib/usr/src/rpm/RPMS/i686/sparse-0.4-1.i686.rpm
error: failed to stat /home/daniel/.gvfs: Permission denied
Preparing...
##################################################
sparse
##################################################
LOG 2:
cd ../obj_s; gcc -I../test -I. -DNDEBUG -D_GNU_SOURCE -I. -I../include
-DHAVE_CONFIG_H -O2 -fPIC -c ../test/worm.c
gcc -O2 -o worm ../obj_s/worm.o -L../lib -lform -lmenu -lpanel
-lncurses
-Wl,-rpath,/home/daniel/work/ltib-mpc837xerdb-20081113/rpm/BUILD/ncurses-5.3/lib
cd ../obj_s; gcc -I../test -I. -DNDEBUG -D_GNU_SOURCE -I. -I../include
-DHAVE_CONFIG_H -O2 -fPIC -c ../test/xmas.c
gcc -O2 -o xmas ../obj_s/xmas.o -L../lib -lform -lmenu -lpanel
-lncurses
-Wl,-rpath,/home/daniel/work/ltib-mpc837xerdb-20081113/rpm/BUILD/ncurses-5.3/lib
make[1]: Leaving directory
`/home/daniel/work/ltib-mpc837xerdb-20081113/rpm/BUILD/ncurses-5.3/test'
cd misc && make
DESTDIR="/home/daniel/work/ltib-mpc837xerdb-20081113/tmp/ncurses" all
make[1]: Entering directory
`/home/daniel/work/ltib-mpc837xerdb-20081113/rpm/BUILD/ncurses-5.3/misc'
make[1]: Nothing to be done for `all'.
make[1]: Leaving directory
`/home/daniel/work/ltib-mpc837xerdb-20081113/rpm/BUILD/ncurses-5.3/misc'
cd Ada95 && make
DESTDIR="/home/daniel/work/ltib-mpc837xerdb-20081113/tmp/ncurses" all
make[1]: Entering directory
`/home/daniel/work/ltib-mpc837xerdb-20081113/rpm/BUILD/ncurses-5.3/Ada95'
for d in gen src samples; do \
(cd $d ; make all) ;\
done
make[2]: Entering directory
`/home/daniel/work/ltib-mpc837xerdb-20081113/rpm/BUILD/ncurses-5.3/Ada95/gen'
gcc -I. -I../../include -DHAVE_CONFIG_H -I. -O2 -c -o gen.o ./gen.c
gcc -I. -I../../include -DHAVE_CONFIG_H -I. -O2 gen.o
-Wl,-rpath,/home/daniel/work/ltib-mpc837xerdb-20081113/rpm/BUILD/ncurses-5.3/lib
-o gen -L../../lib -lncurses
./gen '' B K >Key_Definitions
/bin/sh: ./gen: cannot execute binary file
make[2]: *** [Key_Definitions] Error 126
make[2]: Leaving directory
`/home/daniel/work/ltib-mpc837xerdb-20081113/rpm/BUILD/ncurses-5.3/Ada95/gen'
make[2]: Entering directory
`/home/daniel/work/ltib-mpc837xerdb-20081113/rpm/BUILD/ncurses-5.3/Ada95/src'
gnatmake -O3 -gnatpn -I. -I. -c -o
terminal_interface.o ./terminal_interface.ads
gcc-4.3 -c -I./ -O3 -gnatpn -I. -I. -I- ./terminal_interface.ads
make[2]: *** No rule to make target `terminal_interface-curses.ads',
needed by `terminal_interface-curses-aux.o'. Stop.
make[2]: Leaving directory
`/home/daniel/work/ltib-mpc837xerdb-20081113/rpm/BUILD/ncurses-5.3/Ada95/src'
make[2]: Entering directory
`/home/daniel/work/ltib-mpc837xerdb-20081113/rpm/BUILD/ncurses-5.3/Ada95/samples'
cp ./explain.txt explain.msg
gnatmake -a -A. -A../src -A./../src tour -cargs -O3 -gnatpn -I. -largs
-L../../lib -L../lib -lform -lmenu -lpanel -lncurses
-Wl,-rpath,/home/daniel/work/ltib-mpc837xerdb-20081113/rpm/BUILD/ncurses-5.3/lib
-lAdaCurses
gcc-4.3 -c -I. -I../src -I./../src -O3 -gnatpn -I. tour.adb
gcc-4.3 -c -I. -I../src -I./../src -O3 -gnatpn -I. sample.adb
sample.adb:46:06: file "terminal_interface-curses.ads" not found
sample.adb:46:06: "Sample (body)" depends on "Terminal_Interface.Curses
(body)"
sample.adb:46:06: "Terminal_Interface.Curses (body)" depends on
"Terminal_Interface.Curses (spec)"
sample.adb:47:06: file "terminal_interface-curses-panels.ads" not found
sample.adb:47:06: "Sample (body)" depends on
"Terminal_Interface.Curses.Panels (body)"
sample.adb:47:06: "Terminal_Interface.Curses.Panels (body)" depends on
"Terminal_Interface.Curses.Panels (spec)"
sample.adb:48:06: file "terminal_interface-curses-menus.ads" not found
sample.adb:48:06: "Sample (body)" depends on
"Terminal_Interface.Curses.Menus (body)"
sample.adb:48:06: "Terminal_Interface.Curses.Menus (body)" depends on
"Terminal_Interface.Curses.Menus (spec)"
sample.adb:49:06: file
"terminal_interface-curses-menus-menu_user_data.ads" not found
sample.adb:49:06: "Sample (body)" depends on
"Terminal_Interface.Curses.Menus.Menu_User_Data (body)"
sample.adb:49:06: "Terminal_Interface.Curses.Menus.Menu_User_Data
(body)" depends on "Terminal_Interface.Curses.Menus.Menu_User_Data
(spec)"
sample.adb:50:06: file
"terminal_interface-curses-menus-item_user_data.ads" not found
sample.adb:50:06: "Sample (body)" depends on
"Terminal_Interface.Curses.Menus.Item_User_Data (body)"
sample.adb:50:06: "Terminal_Interface.Curses.Menus.Item_User_Data
(body)" depends on "Terminal_Interface.Curses.Menus.Item_User_Data
(spec)"
gnatmake: "sample.adb" compilation error
make[2]: *** [tour] Error 4
make[2]: Leaving directory
`/home/daniel/work/ltib-mpc837xerdb-20081113/rpm/BUILD/ncurses-5.3/Ada95/samples'
make[1]: *** [all] Error 2
make[1]: Leaving directory
`/home/daniel/work/ltib-mpc837xerdb-20081113/rpm/BUILD/ncurses-5.3/Ada95'
make: *** [all] Error 2
error: Bad exit status
from /home/daniel/work/ltib-mpc837xerdb-20081113/tmp/rpm-tmp.47545 (%
build)
RPM build errors:
Bad exit status
from /home/daniel/work/ltib-mpc837xerdb-20081113/tmp/rpm-tmp.47545 (%
build)
Build time for ncurses: 126 seconds
Failed building ncurses
f_buildrpms() returned an error, exiting
traceback:
main:548
Started: Thu Jul 9 20:27:19 2009
Ended: Thu Jul 9 20:52:15 2009
Elapsed: 1496 seconds
These packages failed to build:
ncurses
Build Failed
--
Daniel Li
- [Ltib] ncurses or .gvfs failed?,
Daniel.Li <=
- Re: [Ltib] ncurses or .gvfs failed?, Stuart Hughes, 2009/07/09
- Re: [Ltib] ncurses or .gvfs failed?, Daniel.Li, 2009/07/09
- Re: [Ltib] ncurses or .gvfs failed?, Daniel.Li, 2009/07/09
- Re: [Ltib] ncurses or .gvfs failed?, Stuart Hughes, 2009/07/10
- Re: [Ltib] ncurses or .gvfs failed?, Daniel.Li, 2009/07/10
- Re: [Ltib] ncurses or .gvfs failed?, Stuart Hughes, 2009/07/10
- Re: [Ltib] ncurses or .gvfs failed?, Daniel.Li, 2009/07/10
- Re: [Ltib] ncurses or .gvfs failed?, Stuart Hughes, 2009/07/10
- Re: [Ltib] ncurses or .gvfs failed?, Svein Seldal, 2009/07/10
- Re: [Ltib] ncurses or .gvfs failed?, Stuart Hughes, 2009/07/13