Hi, Stuart
I still receive the same error (see below), in my log you can see GTK+ packets was installed on my host mashine.
creating libprintbackend-lpr.la <http://libprintbackend-lpr.la>
(cd .libs && rm -f libprintbackend-lpr.la <http://libprintbackend-lpr.la> && ln -s ../libprintbackend-lpr.la <http://libprintbackend-lpr.la> libprintbackend-lpr.la <http://libprintbackend-lpr.la>)
make[4]: Leaving directory `/home/dima/ltib_install_2/ltib/rpm/BUILD/gtk+-2.12.1/modules/printbackends/lpr'
make[4]: Entering directory `/home/dima/ltib_install_2/ltib/rpm/BUILD/gtk+-2.12.1/modules/printbackends'
make[4]: Nothing to be done for `all-am'.
make[4]: Leaving directory `/home/dima/ltib_install_2/ltib/rpm/BUILD/gtk+-2.12.1/modules/printbackends'
make[3]: Leaving directory `/home/dima/ltib_install_2/ltib/rpm/BUILD/gtk+-2.12.1/modules/printbackends'
make[3]: Entering directory `/home/dima/ltib_install_2/ltib/rpm/BUILD/gtk+-2.12.1/modules'
make[3]: Nothing to be done for `all-am'.
make[3]: Leaving directory `/home/dima/ltib_install_2/ltib/rpm/BUILD/gtk+-2.12.1/modules'
make[2]: Leaving directory `/home/dima/ltib_install_2/ltib/rpm/BUILD/gtk+-2.12.1/modules'
Making all in demos
make[2]: Entering directory `/home/dima/ltib_install_2/ltib/rpm/BUILD/gtk+-2.12.1/demos'
no --raw --build-list \
apple_red ./apple-red.png \
gnome_foot ./gnome-foot.png \
> test-inline-pixbufs.h \
|| (rm -f test-inline-pixbufs.h && false)
/bin/bash: no: command not found
make[2]: *** [test-inline-pixbufs.h] Error 1
make[2]: Leaving directory `/home/dima/ltib_install_2/ltib/rpm/BUILD/gtk+-2.12.1/demos'
make[1]: *** [all-recursive] Error 1
make[1]: Leaving directory `/home/dima/ltib_install_2/ltib/rpm/BUILD/gtk+-2.12.1'
make: *** [all] Error 2
error: Bad exit status from /home/dima/ltib_install_2/ltib/tmp/rpm-tmp.61883 (%build)
RPM build errors:
Bad exit status from /home/dima/ltib_install_2/ltib/tmp/rpm-tmp.61883 (%build)
Build time for gtk2: 537 seconds
Failed building gtk2
f_buildrpms() returned an error, exiting
traceback:
main:554
Started: Thu Jul 9 15:41:44 2009
Ended: Thu Jul 9 15:52:07 2009
Elapsed: 623 seconds
These packages failed to build:
gtk2
Build Failed
Exiting on error or interrupt
address@hidden:~/ltib_install_2/ltib$
address@hidden:~/ltib_install_2/ltib$ *gdk-pixbuf-csource*
Usage: gdk-pixbuf-csource [options] [image]
gdk-pixbuf-csource [options] --build-list [[name image]...]
--stream generate pixbuf data stream
--struct generate GdkPixdata structure
--macros generate image size/pixel macros
--rle use one byte run-length-encoding
--raw provide raw image data copy
--extern generate extern symbols
--static generate static symbols
--decoder provide rle decoder
--name=identifier C macro/variable name
--build-list parse (name, image) pairs
-h, --help show this help message
-v, --version print version informations
--g-fatal-warnings make warnings fatal (abort)
address@hidden:~/ltib_install_2/ltib$
address@hidden:~/ltib_install_2/ltib$
address@hidden:~/ltib_install_2/ltib$ *pkg-config --libs gtk+-2.0*
-lgtk-x11-2.0 -lgdk-x11-2.0 -latk-1.0 -lpangoft2-1.0 -lgdk_pixbuf-2.0 -lm -lpangocairo-1.0 -lgio-2.0 -lcairo -lpango-1.0 -lfreetype -lfontconfig -lgobject-2.0 -lgmodule-2.0 -lglib-2.0 address@hidden:~/ltib_install_2/ltib$
2009/7/9 Stuart Hughes <address@hidden <mailto:address@hidden>>
Hi Dmitry, You need to install gtk2-devel on your host which
provides the missing gdk-pixbuf-csource utility. Regards, Stuart