[Top][All Lists]
[Date Prev][Date Next][Thread Prev][Thread Next][Date Index][Thread Index]
Re: [Ltib] Problem with building GTK+
From: |
Stuart Hughes |
Subject: |
Re: [Ltib] Problem with building GTK+ |
Date: |
Mon, 22 Mar 2010 11:28:56 +0000 |
User-agent: |
Thunderbird 2.0.0.16 (X11/20080707) |
Hi Murat,
This platform is not on the public LTIB, so you may need to go back to
the vendor for support.
The only thing I can think off is that the build is using dynamic
linking in one place and static in another.
Regards, Stuart
Murat Sahin wrote:
> Hi,
>
> I have a Problem with building gtk+.
>
> - The target platform is i.mx25
>
> Following packages are selected:
>
> [*] GTK2
> [*] DirectFB
> [*] configure for use with touchscreen
> [*] DirectFB-examples *"if you would like to test DirectFB"*
> [*] Liberation fonts
> [*] Tslib
>
>
> I want to compile GTK over DirectFb, but I get the following errors:
> --------------------------------------------------------------------------------snip
> start-------------------------------------------------------------------------------------------------------------
>
> /opt/freescale/usr/local/gcc-4.1.2-glibc-2.5-nptl-3/arm-none-linux-gnueabi/lib/gcc/arm-none-linux-gnueabi/4.1.2/../../../../arm-none-linux-gnueabi/bin/ld:
> Warning: size of symbol `IA__gdk_window_show_unraised' changed from 172
> in .libs/gdkwindow.o to 148 in
> directfb/.libs/libgdk-directfb.a(gdkwindow-directfb.o)
> collect2: ld returned 1 exit status
> make[4]: *** [libgdk-directfb-2.0.la] Error 1
> make[4]: Leaving directory `/home/nighty/ltib/rpm/BUILD/gtk+-2.14.3/gdk'
> make[3]: *** [all-recursive] Error 1
> make[3]: Leaving directory `/home/nighty/ltib/rpm/BUILD/gtk+-2.14.3/gdk'
> make[2]: *** [all] Error 2
> make[2]: Leaving directory `/home/nighty/ltib/rpm/BUILD/gtk+-2.14.3/gdk'
> make[1]: *** [all-recursive] Error 1
> make[1]: Leaving directory `/home/nighty/ltib/rpm/BUILD/gtk+-2.14.3'
> make: *** [all] Error 2
> error: Bad exit status from /home/nighty/ltib/tmp/rpm-tmp.94789 (%build)
>
>
> RPM build errors:
> Bad exit status from /home/nighty/ltib/tmp/rpm-tmp.94789 (%build)
> Build time for gtk2: 249 seconds
>
> Failed building gtk2
>
>
> f_buildrpms() returned an error, exiting
> traceback:
> main:560
> ----------------------------------------------------------------------------------snip
> end-----------------------------------------------------------------------------------------------------------
>
>
> Thanks for your help.
> Regards,
>
> /*Murat Sahin
> */
> *Zeisberg GmbH*
> address@hidden
>
>
> ------------------------------------------------------------------------
>
> _______________________________________________
> LTIB home page: http://ltib.org
>
> Ltib mailing list
> address@hidden
> http://lists.nongnu.org/mailman/listinfo/ltib